program: Gaussian 09
title: 000158282
version: EM64L-G09RevD.01
frameworkgroup: C1[X(C8H16O4)]
method: RPBEPBE
basis: SDD
operation: Freq
keyword: #pfreq=noraman
keyword: PBEPBE/SDD
title: #p freq=noraman PBEPBE/SDD
converged: YES YES NO NO
title: Mulliken charges:
elementType: O O O O C C C C C C C C H H H H H H H H H H H H H H H H
charge: -0.282196 -0.148385 -0.170062 -0.206365 -0.370671 -0.347123 -0.246743 -0.259480 -0.684869 -0.274851 0.286773 -0.739446 0.207569 0.207638 0.193300 0.193227 0.186541 0.186418 0.207530 0.207458 0.211946 0.211925 0.217031 0.226074 0.225979 0.253595 0.253634 0.253555
chargesum: 0.00000
title: Mulliken charges with hydrogens summed into heavy atoms:
elementType: O O O O C C C C C C C C
charge: -0.282196 -0.148385 -0.170062 -0.206365 0.044536 0.039404 0.126215 0.155508 -0.043968 0.177201 0.286773 0.021338
polarizability: 1.62218264e+02 -8.30865406e-01 9.42037066e+01 5.01661603e-02 1.83796176e-02 7.60759231e+01
1716.lowfreq: -98.0092 -4.7299 -0.0006 -0.0003 0.0005 4.4601 4.9022 18.2405 33.1723
frequency: -98.0063 15.9393 32.5648 42.0952 43.3068 71.4268 85.2328 105.6577 120.8304 133.0382 180.3050 186.7581 204.1071 232.4711 302.3277 346.0845 414.5026 468.0344 492.5963 547.2061 598.3870 742.3046 807.5121 823.2676 843.5234 848.8410 887.7714 919.1984 937.2191 948.8369 986.0374 1026.1903 1035.5569 1064.0168 1077.9080 1089.4638 1111.9749 1128.6312 1146.5589 1150.2442 1167.3814 1211.2737 1246.4494 1270.1161 1272.6911 1283.5849 1316.5548 1345.2877 1364.1510 1374.2425 1393.0988 1409.6731 1452.7026 1454.5622 1470.1351 1473.4482 1478.4552 1480.4129 1488.0718 1492.5756 1498.4161 1698.2162 2915.8725 2947.0757 2964.6881 2967.7446 2976.6461 2992.8856 2998.7421 3009.0299 3010.5462 3010.8994 3056.0157 3075.0425 3075.9414 3083.0824 3103.6602 3140.4182
redmass: 1.0873 5.5308 2.4176 4.4068 3.8683 1.9377 2.6507 4.6637 2.1107 2.8629 5.5450 5.5963 3.8856 1.1237 4.0817 4.0497 3.3641 5.0759 3.2843 3.3160 6.0216 1.0740 1.1285 5.4389 1.0926 10.6014 2.9094 2.8929 1.1458 2.7331 4.9032 4.4523 1.6013 6.1093 2.7766 2.4861 1.4030 2.7632 1.3474 3.0005 1.2364 1.3696 1.1470 1.2882 1.1557 1.0864 1.2414 1.4456 1.4289 1.2086 1.2170 1.4689 1.0465 1.0546 1.0748 1.0686 1.0417 1.0692 1.0777 1.0836 1.0817 10.6240 1.0548 1.0544 1.1060 1.0588 1.0365 1.0592 1.1072 1.0545 1.0357 1.1006 1.1040 1.1012 1.0994 1.1107 1.0984 1.1010
irintensity: 0.1232 0.0441 3.3400 1.3772 4.8978 0.0044 6.2232 2.2422 3.6187 6.3208 0.1959 0.1529 1.2556 0.0690 1.1925 2.0347 4.6372 15.0418 3.5983 1.5896 8.0337 9.3020 0.3256 71.8298 0.7694 20.3078 19.1268 7.1247 0.7065 5.8702 34.0253 17.6766 9.2794 143.5679 36.3068 6.0270 0.0033 26.1107 0.8711 212.9653 6.7328 0.2984 0.4706 1.0893 0.0381 0.0832 10.4487 0.0020 17.5048 35.0959 9.4439 1.5513 20.0567 23.2507 1.2551 0.5578 12.8898 5.1276 12.7112 12.0848 11.7147 260.8648 51.3026 53.2345 49.8852 38.3724 32.3058 41.2196 34.8300 37.2534 3.7475 6.7752 25.0712 96.0193 51.3493 47.2244 7.8521 5.4599
temp: 298.150 k
press: 1.00000 atm
elementType: 8 8 8 8 6 6 6 6 6 6 6 6 1 1 1 1 1 1 1 1 1 1 1 1 1 1 1 1
symmnumber: 1
zpe: 611098.7 jmol-1
zpe.correction: 0.232755 hartree
zpe.thermalcorrener: 0.247902 hartree
zpe.thermalcorrenthalpy: 0.248846 hartree
zpe.thermalcorrgfe: 0.186773 hartree
zpe.sumelectzpe: -614.256249 hartree
zpe.sumelectthermal: -614.241102 hartree
zpe.sumelectthermalent: -614.240158 hartree
zpe.sumelectthermalfe: -614.302232 hartree
dipole: -1.5794 -1.7874 0.0072
dipole: 2.3852
quadrupole: -63.9372 -76.4437 -71.4640
quadrupole: -17.7861 -0.0041 -0.0232
quadrupole: 6.6778 -5.8288 -0.8490 -17.7861 -0.0041 -0.0232
hfenergy: -614.4890043 hartree
pointgroup: C01 [X(C8H16O4)]
dipole: -0.6234897 0.7012947 0.0072502 debye
polarizability: 162.2122171|1.037787|94.2059001|-0.1873134|0.2493695|76.0797763 unknown
InChI: InChI=1S/C8H16O4/c1-3-4-5-10-6-7-11-12-8(2)9/h3-7H2,1-2H3
charge 0 multiplicity 1
28 atoms
O  -1.530042 0.218946 0.006294
O  2.056501 -0.435775 -0.006673
O  3.202555 0.59095 0.00229
O  4.611201 -1.303543 -0.033404
C  -3.953238 0.345001 0.008858
C  -5.300876 -0.414012 -0.000818
C  -2.751479 -0.602961 -0.00384
C  -0.314484 -0.597499 -0.008072
C  -6.514309 0.540258 0.010898
C  0.845651 0.40817 0.001343
C  4.455213 -0.074667 -0.013749
C  5.528253 1.005096 -0.00245
H  -3.890241 1.013536 -0.871352
H  -3.889932 0.99024 0.906273
H  -5.352156 -1.087695 0.878817
H  -5.351869 -1.0655 -0.89704
H  -2.763325 -1.268941 0.888568
H  -2.764073 -1.245663 -0.91318
H  -0.266882 -1.25626 0.885054
H  -0.272871 -1.233151 -0.918045
H  -6.50514 1.181403 0.912167
H  -6.503713 1.204956 -0.873127
H  -7.467504 -0.019117 0.002764
H  0.813098 1.031082 0.913286
H  0.813655 1.048682 -0.898312
H  5.431301 1.661024 -0.884106
H  5.439212 1.634282 0.899284
H  6.512395 0.514257 -0.014228
