program: Gaussian 09
title: 000158280
version: EM64L-G09RevD.01
frameworkgroup: C1[X(C15H14O3)]
method: RPBEPBE
basis: SDD
operation: Freq
keyword: #pfreq=noraman
keyword: PBEPBE/SDD
title: #p freq=noraman PBEPBE/SDD
converged: YES YES NO NO
title: Mulliken charges:
elementType: O O O C C C C C C C C C C C C C C C H H H H H H H H H H H H H H
charge: -0.290599 -0.438154 -0.432125 -0.184582 -0.461317 -0.540633 0.387772 0.510606 0.197692 -0.387740 -0.568746 -0.443661 -0.356870 -0.387046 0.318674 -0.383408 -0.348993 0.280692 0.223473 0.236870 0.226573 0.215953 0.232720 0.232028 0.246079 0.232086 0.256043 0.249803 0.219311 0.250425 0.353539 0.353536
chargesum: 0.00000
title: Mulliken charges with hydrogens summed into heavy atoms:
elementType: O O O C C C C C C C C C C C C C C C
charge: -0.290599 -0.084615 -0.078589 0.038891 0.002125 -0.091960 0.387772 0.510606 0.197692 -0.155713 -0.322667 -0.211575 -0.100827 -0.137243 0.318674 -0.164097 -0.098568 0.280692
polarizability: 2.54487051e+02 -5.49186762e-01 1.56092027e+02 -8.44874709e+00 9.16143989e+00 1.06265171e+02
1716.lowfreq: -3.8430 0.0002 0.0004 0.0006 3.0777 7.4474 23.8236 40.2947 53.4563
frequency: 23.6000 40.1554 53.4548 112.4182 134.8765 176.5074 216.3514 226.6886 250.9885 283.6171 322.2450 350.0685 354.8759 376.8208 391.6720 408.7553 418.4039 439.2903 446.7649 486.2656 515.3533 549.1310 557.9033 609.0267 622.1540 635.1052 696.2915 718.7884 725.3470 738.0459 779.3897 803.0702 803.7144 824.6518 837.0098 840.4256 856.7204 905.1844 925.1010 940.0664 942.8891 967.0171 988.1709 1004.5610 1039.6666 1066.7475 1099.1274 1103.5799 1128.0586 1142.9992 1157.3102 1171.2386 1178.1528 1193.5802 1203.1273 1219.6481 1248.8087 1256.6798 1284.5963 1289.9902 1308.9956 1325.5342 1334.5257 1356.3677 1395.3741 1398.0281 1426.4711 1433.6021 1454.7811 1461.7122 1500.6733 1508.0158 1598.3182 1600.9649 1628.1835 1630.0270 2960.9363 2964.7026 3002.4473 3031.7157 3066.9554 3110.4491 3121.1752 3134.3244 3137.0801 3148.9111 3172.8337 3176.7789 3582.8495 3583.6937
redmass: 3.8570 5.8884 5.9552 4.4810 4.0767 4.7386 3.4949 6.4912 5.0703 4.4650 2.9041 1.1593 1.1082 5.1568 3.8422 3.0562 4.8429 3.5006 2.8257 6.3915 3.3530 3.3314 3.2137 4.4145 6.3336 6.7481 2.9041 4.3009 3.8141 5.3201 2.8791 1.6843 1.3916 2.3533 1.6841 1.6116 3.9168 2.5377 1.5887 1.8635 1.4707 1.3725 3.0692 2.7191 2.5207 2.4606 1.8650 1.4136 1.7227 1.3783 1.2855 1.3147 1.1142 1.7335 1.5484 1.7225 2.8662 1.8744 1.6128 1.5580 1.5277 1.3366 1.5485 1.6845 6.8981 5.1691 2.9129 3.1872 1.1022 1.1233 2.9396 2.8640 6.5940 6.6957 6.8378 6.8261 1.0758 1.0742 1.0625 1.0935 1.1030 1.0872 1.0899 1.0967 1.0917 1.0884 1.0967 1.0949 1.0660 1.0660
irintensity: 0.9515 0.5022 0.0566 4.0265 0.9378 0.3621 0.3528 1.9970 1.4573 2.4411 1.0700 136.2383 150.7903 4.6557 18.2182 2.0202 5.4021 9.9737 16.2893 5.1652 10.4760 27.1579 3.4603 7.7410 15.2701 1.4870 2.4343 6.4364 2.0518 8.0182 4.7531 8.2533 35.3004 21.0394 64.4768 26.6789 12.0526 11.9747 0.8284 9.8810 4.2646 2.5942 108.1646 2.2595 37.2947 46.9110 158.5159 50.7717 348.9357 212.3154 8.1228 6.8809 7.7739 8.0165 5.2103 2.1535 33.5688 22.5826 46.6979 49.2269 6.6608 2.5707 13.7865 3.1981 7.8244 36.0713 21.9283 8.9738 6.9344 15.0667 168.0390 70.4235 11.4481 88.9945 126.0464 34.2799 11.3839 57.4504 24.3120 29.1517 30.7130 18.8100 16.8224 19.5622 4.6190 6.2595 5.0852 7.1648 45.1100 34.6313
temp: 298.150 k
press: 1.00000 atm
elementType: 8 8 8 6 6 6 6 6 6 6 6 6 6 6 6 6 6 6 1 1 1 1 1 1 1 1 1 1 1 1 1 1
symmnumber: 1
zpe: 661766.2 jmol-1
zpe.correction: 0.252053 hartree
zpe.thermalcorrener: 0.267235 hartree
zpe.thermalcorrenthalpy: 0.268179 hartree
zpe.thermalcorrgfe: 0.208889 hartree
zpe.sumelectzpe: -804.376682 hartree
zpe.sumelectthermal: -804.361500 hartree
zpe.sumelectthermalent: -804.360556 hartree
zpe.sumelectthermalfe: -804.419847 hartree
dipole: -2.4647 2.0432 1.2272
dipole: 3.4286
quadrupole: -104.5323 -94.4661 -104.8146
quadrupole: -4.7543 -9.4695 0.5313
quadrupole: -3.2613 6.8049 -3.5436 -4.7543 -9.4695 0.5313
hfenergy: -804.6287356 hartree
pointgroup: C01 [X(C15H14O3)]
dipole: -0.9571513 0.6993148 0.6437741 debye
polarizability: 254.1896659|1.0217359|150.7871162|-10.6200269|17.8992718|111.8674667 unknown
InChI: InChI=1S/C15H14O3/c16-12-5-1-10(2-6-12)14-8-4-11-3-7-13(17)9-15(11)18-14/h1-3,5-7,9,14,16-17H,4,8H2
charge 0 multiplicity 1
32 atoms
O  0.433111 -0.495609 0.219517
O  4.933194 -2.243208 -0.285557
O  -5.878391 -0.940492 -0.497534
C  -0.453593 0.651697 0.577496
C  -0.05258 1.900782 -0.240383
C  1.399509 2.309755 0.088645
C  2.329873 1.106603 0.013714
C  -1.878689 0.198995 0.333066
C  1.806192 -0.212457 0.074767
C  3.730495 1.245996 -0.143541
C  2.645808 -1.346352 -0.024555
C  -2.899886 0.51211 1.259246
C  -2.224436 -0.501863 -0.851606
C  4.591931 0.136611 -0.238483
C  4.03556 -1.163571 -0.181686
C  -4.243332 0.15319 1.010722
C  -3.556315 -0.875123 -1.109906
C  -4.567912 -0.541321 -0.178707
H  -0.301748 0.863759 1.657206
H  -0.160308 1.666046 -1.316502
H  -0.756354 2.720813 -0.008459
H  1.433462 2.758257 1.103335
H  1.741289 3.095798 -0.610399
H  4.155451 2.255969 -0.200462
H  2.191889 -2.343034 0.027822
H  -2.650524 1.038643 2.188737
H  -1.4349 -0.778713 -1.557775
H  5.671953 0.25206 -0.361179
H  -5.024475 0.402595 1.740704
H  -3.832413 -1.423779 -2.015189
H  4.450254 -3.105439 -0.2426
H  -6.511418 -0.673821 0.214445
