program: Gaussian 09
title: 000158278
version: EM64L-G09RevD.01
frameworkgroup: C1[X(C10H9NO3)]
method: RPBEPBE
basis: SDD
operation: Freq
keyword: #p
keyword: freq=noraman
keyword: PBEPBE/SDD
title: #p freq=noraman PBEPBE/SDD
converged: YES YES NO NO
title: Mulliken charges:
elementType: O O O N C C C C C C C C C C H H H H H H H H H
charge: -0.271914 -0.266378 -0.267448 -0.011150 0.212091 0.160750 0.383566 -0.456232 -0.299815 -0.367788 -0.199047 -0.251038 -0.448549 -0.122355 0.265617 0.254207 0.257992 0.237975 0.236158 0.223124 0.220672 0.267998 0.241562
chargesum: 0.00000
title: Mulliken charges with hydrogens summed into heavy atoms:
elementType: O O O N C C C C C C C C C C
charge: -0.271914 -0.266378 -0.267448 -0.011150 0.212091 0.160750 0.383566 -0.190615 -0.045607 -0.109796 0.275086 0.192759 0.061011 -0.122355
polarizability: 1.71291854e+02 6.49780806e+00 1.13708930e+02 -3.38725248e+00 1.95282170e+00 7.37600489e+01
1716.lowfreq: -64.0999 -7.2289 0.0001 0.0004 0.0007 3.0273 8.0695 33.0537 38.7606
frequency: -64.0534 33.0418 38.7545 90.1831 123.8329 165.0450 211.7005 225.5956 287.8015 328.1535 331.3508 368.2351 422.6017 455.9234 496.2650 569.7366 595.9745 605.0918 676.9185 705.1007 730.1113 780.9131 804.9808 826.2027 835.8576 842.6276 856.1682 926.2176 931.5881 979.6632 1004.7469 1039.3791 1056.5134 1065.7561 1077.8281 1119.6941 1126.6997 1167.2221 1197.3126 1243.7187 1259.5521 1275.9556 1336.7605 1362.8802 1368.7479 1395.5022 1432.5533 1445.3870 1468.5846 1484.4230 1490.2259 1610.0871 1638.3917 2208.1902 2961.8177 3008.0438 3009.9569 3027.7493 3069.3417 3087.1999 3170.0186 3186.6010 3189.8450
redmass: 2.4037 8.1882 6.1642 5.9371 4.3305 8.9917 3.0929 4.6106 4.9929 7.6018 5.6312 3.2937 2.9955 4.9089 7.3474 5.0268 4.0315 4.4485 9.3899 3.7342 5.4194 6.5589 1.3667 1.8654 5.7341 2.5773 3.8424 1.3269 3.6995 5.3525 3.3052 2.0285 3.0520 1.4565 2.4568 1.0364 1.3227 2.3537 1.1005 1.1794 1.5379 3.8782 1.4311 1.4091 1.3696 3.8882 1.0874 4.3835 1.8651 1.1325 1.3997 7.8334 8.8217 12.4446 1.0560 1.0636 1.0535 1.1033 1.1005 1.1189 1.0888 1.0929 1.0968
irintensity: 13.2404 1.8640 5.3319 5.6212 2.7619 2.5208 1.2143 1.0494 3.8590 1.2971 4.0565 1.0663 4.9335 3.0438 0.3111 0.4168 6.6862 12.5374 0.3963 1.6155 10.6800 16.6282 24.3451 49.0092 40.1364 19.4187 0.2679 0.0682 16.2610 169.2274 51.6206 9.6794 15.0609 4.3867 5.1276 0.0201 24.1803 368.5224 2.9130 0.5524 26.9618 53.7875 4.4329 26.3849 22.4110 2.7604 21.2874 13.8402 298.3032 6.3209 52.7895 34.4354 25.6051 7.4457 40.8757 7.7317 123.6514 34.1679 5.7049 34.7423 3.4900 3.9100 0.8670
temp: 298.150 k
press: 1.00000 atm
elementType: 8 8 8 7 6 6 6 6 6 6 6 6 6 6 1 1 1 1 1 1 1 1 1
symmnumber: 1
zpe: 447596.7 jmol-1
zpe.correction: 0.170481 hartree
zpe.thermalcorrener: 0.182230 hartree
zpe.thermalcorrenthalpy: 0.183174 hartree
zpe.thermalcorrgfe: 0.130990 hartree
zpe.sumelectzpe: -665.812005 hartree
zpe.sumelectthermal: -665.800256 hartree
zpe.sumelectthermalent: -665.799312 hartree
zpe.sumelectthermalfe: -665.851496 hartree
dipole: -1.9945 -3.2726 -2.6909
dipole: 4.6828
quadrupole: -85.8247 -76.7762 -84.6436
quadrupole: -9.0395 -15.4859 -1.3529
quadrupole: -3.4099 5.6386 -2.2288 -9.0395 -15.4859 -1.3529
hfenergy: -665.982486 hartree
pointgroup: C01 [X(C10H9N1O3)]
dipole: 0.8148769 1.4434417 -0.8041755 debye
dipolederiv: -1.2148838 -0.2864821 -0.1924919 -0.4110546 -0.5911313 -0.1462911 -0.2466599 -0.1365739 -0.3184047 -1.3808016 -0.1836321 -0.1825316 -0.1982143 -0.4444891 -0.0779552 -0.2144399 -0.0812517 -0.2910226 -1.8085106 0.4402596 -0.0015544 0.5469308 -0.4650949 -0.0067438 -0.0605661 -0.0057236 -0.2813617 -0.2819728 -0.0050854 0.0091338 -0.0505848 -0.2122691 -0.0018887 0.0815912 -0.0041538 -0.2372542 0.6094238 0.2000629 0.1224553 0.8760828 0.5165756 0.2350454 0.3239262 0.1593872 0.1394938 1.088012 0.1737811 0.186203 -0.3767442 -0.2488986 -0.1143586 0.0499112 -0.0438166 -0.0027812 1.5510334 -0.2865765 0.0469582 -0.3258846 0.1383862 -0.0203923 0.1252008 -0.0306937 0.0875141 -0.3657181 0.0021576 -0.0035067 -0.1558948 -0.0647569 0.0275112 -0.0694701 0.0476321 -0.2120672 0.1387519 0.098698 0.0647647 -0.048074 0.1168048 0.0630391 0.0251273 0.0825321 -0.1176581 -0.3983036 -0.0678083 -0.0295191 0.3495416 -0.0800261 0.0717658 0.0704669 0.0172273 -0.1889855 1.1458031 0.1984604 0.1113067 0.2402415 0.5999169 0.0307904 0.130653 0.0285563 0.5990558 0.7616203 -0.1794806 -0.0694438 -0.6192685 0.567721 0.0198636 -0.1367159 0.0654502 0.3463016 0.035355 -0.0194403 0.0257057 -0.0064753 0.15409 0.0614756 0.0192815 0.0606034 0.1290352 -0.0053758 0.046385 -0.0795422 0.077212 0.0000121 -0.0730533 -0.1607718 -0.0616184 0.0397944 0.0971389 0.0616547 0.0001422 0.0790174 -0.0046128 -0.0466789 0.0098347 -0.044394 0.1716879 0.0680115 0.0645965 0.0053745 0.0621911 -0.0068288 -0.04347 0.0025098 -0.0417832 0.1652802 0.0377749 -0.0708361 -0.0403618 -0.0670729 0.04193 -0.0453553 -0.0357532 -0.0443878 0.161919 -0.059295 -0.0321515 -0.0704188 -0.0173174 0.0580491 0.0073145 -0.1657426 -0.0277213 -0.1134761 -0.1137205 -0.0779917 0.0401607 -0.1076111 0.0107227 0.0386121 0.1371118 0.0771753 -0.025924 0.0089936 -0.0073215 -0.0564781 0.1118555 -0.0042185 -0.036229 0.0058628 -0.094452 -0.1126085 -0.0339218 -0.079795 0.072592 0.0825197 -0.1172755 0.0760414 0.0579038 0.0997448 -0.0170374 0.1109072 -0.0359222 0.0099119 -0.0900112 0.0787019 -0.0456418 -0.0077575 -0.0097909 -0.0277946 0.0096777 0.0464677 0.0311396 0.0486152 -0.0433089 0.0265988 0.058496 -0.0119478 0.1062937 unknown
polarizability: 171.5965389|4.3522099|112.7790217|4.0275915|5.3947525|74.3852721 unknown
InChI: InChI=1S/C10H9NO3/c11-4-1-5-12-8-2-3-9-10(6-8)14-7-13-9/h2-3,6H,1,5,7H2
charge 0 multiplicity 1
23 atoms
O  2.875683 1.480776 0.582454
O  3.805353 -0.686598 0.102181
O  -1.734824 -0.106442 -0.501594
N  -5.017672 -0.662222 1.334348
C  1.857109 0.580008 0.187824
C  2.397247 -0.688015 -0.094621
C  -0.338476 -0.220524 -0.334396
C  0.491492 0.861177 0.081272
C  1.586154 -1.751722 -0.501581
C  0.19572 -1.500982 -0.619588
C  4.14388 0.697974 0.519332
C  -2.358188 1.176245 -0.173587
C  -3.868013 0.996097 -0.408115
C  -4.4997 0.074089 0.552225
H  0.109381 1.858271 0.308848
H  2.004167 -2.737853 -0.717099
H  -0.490513 -2.293707 -0.928463
H  4.596546 0.673174 1.525547
H  4.805329 1.15394 -0.238205
H  -2.14916 1.453585 0.878792
H  -1.976258 1.974142 -0.843354
H  -4.028982 0.613848 -1.432797
H  -4.366975 1.981237 -0.336624
