program: Gaussian 09
title: 000158269
version: EM64L-G09RevD.01
frameworkgroup: C1[X(C7H15NO3S)]
method: RPBEPBE
basis: SDD
operation: Freq
keyword: #p
keyword: freq=noraman
keyword: PBEPBE/SDD
title: #p freq=noraman PBEPBE/SDD
converged: NO YES NO NO
title: Mulliken charges:
elementType: S O O O N C C C C C C C H H H H H H H H H H H H H H H
charge: 1.158002 -0.578494 -0.500772 -0.499463 -0.601949 -0.004892 -0.098353 -0.419902 -0.410016 -0.394186 -0.438645 -0.739132 0.190980 0.275639 0.249297 0.196169 0.206261 0.191544 0.203877 0.233176 0.215420 0.199061 0.215145 0.206829 0.224765 0.340803 0.378836
chargesum: 0.00000
title: Mulliken charges with hydrogens summed into heavy atoms:
elementType: S O O O N C C C C C C C
charge: 1.158002 -0.199658 -0.500772 -0.499463 -0.261146 0.186088 0.177286 0.025564 -0.012211 0.042866 -0.024163 -0.092393
polarizability: 1.38332863e+02 5.06636971e+00 1.13762902e+02 -3.06654431e+00 -1.31491445e+00 1.01091526e+02
1716.lowfreq: -17.4685 -5.7681 -0.0020 -0.0020 -0.0012 12.0760 22.5910 56.2513 83.5076
frequency: 21.0622 56.1934 83.4626 135.5193 142.2805 179.2357 196.3728 215.4176 225.0455 271.2875 293.8109 294.4786 309.5134 335.7558 367.0818 384.3097 423.7225 426.1482 469.2943 487.2746 530.3879 614.4558 755.2939 771.1406 818.6358 846.9656 849.7835 861.4324 884.6034 940.5275 956.5060 969.3778 986.7054 990.2822 1026.2753 1044.1820 1079.4629 1097.4785 1106.6246 1143.9733 1155.6279 1206.4115 1247.4232 1258.9919 1276.1539 1283.2444 1304.0328 1319.4312 1333.2039 1342.5777 1345.7240 1361.5266 1389.5789 1394.9468 1448.9306 1453.5472 1467.0571 1476.5297 1476.9917 1479.4034 2930.7797 2959.4934 2963.5218 2969.5162 2977.1884 2987.1147 3027.0047 3034.7023 3038.9907 3049.9202 3063.2820 3064.9762 3072.8253 3459.8528 3484.1555
redmass: 5.5593 4.8421 3.6143 4.1332 3.6399 1.6446 3.3129 1.5949 1.3920 2.7967 2.3605 2.8092 2.9877 6.3394 3.1625 4.1704 2.3457 2.1552 2.9948 3.0002 14.1401 2.3665 2.3582 2.9413 2.2497 1.5497 2.5602 3.6214 2.1557 1.8367 2.4712 1.4975 2.1999 3.4675 1.2952 1.5293 1.5796 2.6795 1.4204 2.3141 1.6508 1.5193 1.3428 1.2747 1.3311 1.3188 1.2757 1.3459 1.4993 1.4707 1.4299 1.5401 1.2193 1.1791 1.0837 1.0854 1.0837 1.0536 1.0785 1.0598 1.0812 1.0657 1.0629 1.0370 1.0623 1.0637 1.0969 1.0941 1.0896 1.0990 1.0992 1.0996 1.0995 1.0756 1.0662
irintensity: 2.2182 1.4759 0.7119 1.3258 7.1340 37.5894 10.9136 8.5448 8.9669 23.4152 10.8248 24.1043 44.8766 14.1111 19.5989 23.1505 18.4099 9.5436 7.8163 3.7974 179.3988 22.8993 4.7796 4.4728 3.8055 11.3905 26.4553 60.4933 32.1586 13.2323 18.2360 1.9945 30.7354 36.4842 111.6296 5.1401 1.1440 0.4281 5.5440 23.5870 6.5821 1.5304 10.4854 11.5762 7.1951 11.1438 4.5071 0.7109 0.9426 0.3555 0.5282 7.6117 7.0916 21.7463 12.6660 3.4528 14.9272 15.6090 17.6999 5.5012 17.1701 22.6035 40.4116 32.9478 39.9634 27.0058 51.9364 26.1448 42.9747 9.3834 34.9640 53.0476 37.7695 34.1554 34.7422
temp: 298.150 k
press: 1.00000 atm
elementType: 16 8 8 8 7 6 6 6 6 6 6 6 1 1 1 1 1 1 1 1 1 1 1 1 1 1 1
symmnumber: 1
zpe: 578370.6 jmol-1
zpe.correction: 0.220290 hartree
zpe.thermalcorrener: 0.234397 hartree
zpe.thermalcorrenthalpy: 0.235341 hartree
zpe.thermalcorrgfe: 0.179149 hartree
zpe.sumelectzpe: -953.057603 hartree
zpe.sumelectthermal: -953.043496 hartree
zpe.sumelectthermalent: -953.042552 hartree
zpe.sumelectthermalfe: -953.098743 hartree
dipole: -4.3291 0.8803 -0.2931
dipole: 4.4274
quadrupole: -89.4659 -78.3701 -84.3353
quadrupole: 9.1432 -0.2420 -1.0806
quadrupole: -5.4088 5.6870 -0.2782 9.1432 -0.2420 -1.0806
hfenergy: -953.2778924 hartree
pointgroup: C01 [X(C7H15N1O3S1)]
dipole: 1.7148791 0.3011132 0.0513876 debye
polarizability: 137.7241984|-5.4514818|113.9043413|-4.8277089|2.0847652|101.5587514 unknown
InChI: InChI=1S/C7H15NO3S/c1-6-3-2-4-7(5-6)8-12(9,10)11/h6-9H,2-5H2,1H3
charge 0 multiplicity 1
27 atoms
S  -2.385083 0.116424 0.26681
O  -1.836263 1.912317 0.458956
O  -3.304287 -0.23264 1.541211
O  -2.908452 -0.103785 -1.238758
N  -0.817196 -0.69072 0.43262
C  1.938681 0.873371 0.251246
C  0.124126 -0.692484 -0.726291
C  0.919414 0.630483 -0.890887
C  2.885135 -0.346295 0.399498
C  1.078963 -1.901282 -0.526318
C  2.104572 -1.666192 0.6079
C  2.725517 2.180505 0.015912
H  1.37528 0.990512 1.204509
H  -0.503414 -0.868516 -1.618982
H  0.214863 1.479783 -0.960846
H  1.467237 0.574769 -1.854266
H  3.585693 -0.179097 1.240893
H  3.503629 -0.428773 -0.519458
H  1.622894 -2.045548 -1.481337
H  0.482508 -2.812106 -0.341014
H  2.80394 -2.522373 0.650621
H  1.589876 -1.644883 1.59149
H  3.436655 2.373855 0.840534
H  3.306985 2.123543 -0.924749
H  2.04493 3.048464 -0.058698
H  -0.424034 -0.490073 1.364074
H  -2.658671 2.476342 0.54713
