program: Gaussian 09
title: 000158262
version: EM64L-G09RevD.01
frameworkgroup: C1[X(C12H5Cl4I)]
method: RPBEPBE
basis: SDD
operation: Freq
keyword: #p
keyword: freq=noraman
keyword: PBEPBE/SDD
title: #p freq=noraman PBEPBE/SDD
converged: NO NO NO NO
title: Mulliken charges:
elementType: I Cl Cl Cl Cl C C C C C C C C C C C C H H H H H
charge: 0.116190 0.034875 0.046712 0.013525 0.055685 0.448679 0.276503 -0.350979 -0.388222 -0.342179 -0.342157 -0.025371 -0.086887 -0.101419 -0.148004 -0.148010 -0.356110 0.285061 0.252413 0.252411 0.253640 0.253643
chargesum: 0.00000
title: Mulliken charges with hydrogens summed into heavy atoms:
elementType: I Cl Cl Cl Cl C C C C C C C C C C C C
charge: 0.116190 0.034875 0.046712 0.013525 0.055685 0.448679 0.276503 -0.350979 -0.103161 -0.089766 -0.089747 -0.025371 -0.086887 -0.101419 0.105636 0.105633 -0.356110
polarizability: 3.15918855e+02 -9.69755364e+00 1.62542427e+02 -5.33441025e-03 -4.39660190e-03 1.06860824e+02
1716.lowfreq: -28.9050 -6.4516 -3.4943 -0.0016 -0.0014 -0.0004 10.2777 25.5896 33.5512
frequency: -28.1111 25.5831 33.4762 75.8158 79.1759 116.0065 126.4966 169.3685 194.5765 208.8188 210.2905 240.9817 265.0735 300.0875 311.4368 326.6056 351.2815 394.5393 399.2066 466.5667 511.6727 538.4242 581.8102 596.4989 608.0474 640.9366 687.5232 721.2005 738.3180 779.6642 827.0528 834.6205 835.3844 884.2386 956.2805 970.1586 988.8192 1015.7461 1054.2402 1100.5500 1109.1642 1169.5846 1193.0166 1266.4520 1293.2649 1320.3620 1336.7336 1342.5649 1381.1602 1398.6314 1471.4048 1524.4229 1560.4318 1567.8822 1596.2054 3139.7505 3140.6980 3162.1299 3166.1921 3169.0688
redmass: 4.0167 18.0465 15.8077 31.5501 14.3199 9.2006 33.6370 8.9608 29.6457 26.1871 31.8009 6.7080 5.9338 7.0039 17.2045 18.9101 15.3451 5.2174 3.4727 4.4056 10.6026 5.4811 3.9724 11.6953 7.9449 9.2645 8.4242 3.7323 5.8506 7.5082 4.3682 2.0195 1.2445 1.4465 1.3299 1.3757 6.1416 9.2848 2.7457 4.1036 1.4254 1.8772 1.1127 4.1442 1.2469 5.7684 8.4655 5.3671 3.3060 3.6693 2.6869 10.3986 7.4303 7.8450 6.4603 1.0890 1.0890 1.0965 1.0977 1.0930
irintensity: 0.0008 0.0506 0.0958 0.0008 0.1929 0.0319 0.0136 0.0846 0.0414 0.3146 0.0254 1.2192 0.2737 2.2262 1.3193 2.4209 6.2094 0.0020 0.0100 6.6443 6.9003 2.8248 27.5716 28.9332 0.0001 0.5794 47.5186 4.3868 1.7432 70.1421 7.7655 20.7647 0.0039 14.6786 0.3500 0.0436 96.4067 16.6347 18.6380 7.7043 5.3835 41.0447 0.9887 40.6537 0.0331 54.4417 21.8325 0.8659 10.1216 146.5609 48.0616 21.5487 0.0011 0.2846 20.9356 1.5822 5.5452 10.1660 0.0957 0.1451
temp: 298.150 k
press: 1.00000 atm
elementType: 53 17 17 17 17 6 6 6 6 6 6 6 6 6 6 6 6 1 1 1 1 1
symmnumber: 1
zpe: 337799.7 jmol-1
zpe.correction: 0.128661 hartree
zpe.thermalcorrener: 0.143956 hartree
zpe.thermalcorrenthalpy: 0.144900 hartree
zpe.thermalcorrgfe: 0.082361 hartree
zpe.sumelectzpe: -2310.831609 hartree
zpe.sumelectthermal: -2310.816314 hartree
zpe.sumelectthermalent: -2310.815370 hartree
zpe.sumelectthermalfe: -2310.877909 hartree
dipole: 1.1166 0.9315 0.0002
dipole: 1.4542
quadrupole: -150.6235 -143.9889 -132.8277
quadrupole: 0.3211 0.0007 -0.0018
quadrupole: -8.1435 -1.5089 9.6524 0.3211 0.0007 -0.0018
hfenergy: -2310.96027 hartree
pointgroup: C01 [X(C12H5Cl4I1)]
dipole: 0.4332819 -0.3736158 -0.0000947 debye
dipolederiv: -0.6117277 0.0118064 -0.0001421 0.0120067 0.0075793 -0.0000614 -0.0004277 0.0000303 -0.016801 -0.2411835 -0.2552109 -0.0000109 -0.2946692 -0.5304632 -0.0000189 -0.0000709 -0.0000665 -0.0059155 -0.260551 0.2921347 0.0000093 0.3531703 -0.4787158 -0.0000242 0.0000539 -0.0000505 0.0054912 -0.2352389 -0.2530384 -0.0000267 -0.3478447 -0.6321579 -0.0000674 -0.0000305 -0.0000353 -0.0167674 -0.7544787 -0.0543915 0.0001561 -0.0294261 -0.0088378 -0.0000025 0.0001724 0.0000146 0.011004 0.4483662 -0.0850078 0.000072 -0.1054012 -0.0616453 0.0000181 -0.0000386 -0.0000132 -0.0411761 0.2469524 -0.0474461 0.0000217 -0.0495129 -0.0594225 -0.0000084 -0.0001533 0.000055 0.0116146 0.0741507 0.4621627 -0.0000253 0.5298935 0.6325922 0.0000557 0.0001435 0.0001136 -0.0464165 -0.2620999 -0.0880959 -0.0000532 -0.0471861 -0.180193 -0.0000044 -0.0000621 0.000006 -0.0794207 -0.0845188 0.006095 0.0837509 -0.0050772 -0.0974983 -0.0166943 -0.1832822 0.0013424 0.057111 -0.0850644 0.0062218 -0.0837479 -0.0050788 -0.0975156 0.0165745 0.1833842 -0.001451 0.057145 0.1020972 -0.5072826 0.0000451 -0.5892709 0.5935749 -0.0000107 -0.0000175 0.0000412 -0.0032846 0.0956565 0.4125831 0.0000896 0.4502773 0.9451409 0.0001283 0.0001287 0.0000619 -0.0341899 0.985357 0.0586987 -0.0002868 0.0590594 -0.3058615 -0.0000049 -0.0002564 -0.000043 -0.0417703 -0.5108127 0.0110233 -0.1499266 0.0179845 -0.0847945 0.000471 0.0159968 -0.0014594 0.0355831 -0.5107568 0.0108965 0.1496861 0.0180917 -0.0848028 -0.0005225 -0.0163031 0.0014631 0.0354664 1.3996106 -0.0240039 0.0002843 -0.0270119 -0.1631777 0.0000453 0.0003199 -0.000051 -0.022355 0.0824836 0.0391987 0.0000108 0.067818 0.0310933 -0.000022 0.0000045 -0.0000126 0.1424653 0.024912 -0.0018374 -0.0830611 -0.0031427 0.1337803 0.005007 -0.090567 0.002892 -0.0142068 0.0248721 -0.0018603 0.0830651 -0.0032103 0.1337738 -0.0049386 0.0906662 -0.0028564 -0.0142125 0.0358744 0.0036821 0.0706849 -0.0007457 0.1537737 -0.0006472 0.067303 -0.0021413 -0.0097371 0.0360995 0.0036717 -0.0705954 -0.0007237 0.1537775 0.0007276 -0.0669638 0.00216 -0.0096272 unknown
polarizability: 316.1945295|7.1892027|162.2667529|0.0052619|-0.0044831|106.8608244 unknown
InChI: InChI=1S/C12H5Cl4I/c13-9-5-8(10(14)12(16)11(9)15)6-1-3-7(17)4-2-6/h1-5H
charge 0 multiplicity 1
22 atoms
I  6.185277 -0.182524 0.000349
Cl -0.213876 2.66862 0.000014
Cl -3.431375 2.562747 0.000174
Cl -3.193495 -3.015435 -0.000347
Cl -4.949837 -0.276242 0.000663
C  -0.298534 -0.114967 -0.00022
C  1.202456 -0.109922 -0.000161
C  -1.06414 1.07978 -0.000136
C  -0.985765 -1.351314 -0.000333
C  1.923208 -0.121246 -1.220874
C  1.92298 -0.121777 1.2207
C  -2.480933 1.037081 0.000028
C  -2.392799 -1.403214 -0.000206
C  -3.153957 -0.211241 0.000176
C  3.336108 -0.142327 -1.22766
C  3.335875 -0.142877 1.22776
C  4.035012 -0.151877 0.000109
H  -0.412458 -2.282603 -0.000464
H  1.385085 -0.111171 -2.175145
H  1.384663 -0.112118 2.174865
H  3.876169 -0.149953 -2.179365
H  3.875736 -0.15092 2.179574
