program: Gaussian 09
title: 000158251
version: EM64L-G09RevD.01
frameworkgroup: C1[X(C11H16BrNO2)]
method: RPBEPBE
basis: SDD
operation: Freq
keyword: #p
keyword: freq=noraman
keyword: PBEPBE/SDD
title: #p freq=noraman PBEPBE/SDD
converged: YES YES NO NO
title: Mulliken charges:
elementType: Br O O N C C C C C C C C C C C H H H H H H H H H H H H H H H H
charge: -0.016064 -0.270569 -0.271928 -0.547261 -0.517007 -0.110569 0.219504 0.213657 0.222935 -0.698673 -0.331759 -0.325730 -0.241910 -0.536298 -0.538220 0.222829 0.210538 0.239001 0.232624 0.197904 0.222314 0.259875 0.252144 0.261483 0.261724 0.224721 0.224858 0.245264 0.224451 0.244930 0.225232
chargesum: 0.00000
title: Mulliken charges with hydrogens summed into heavy atoms:
elementType: Br O O N C C C C C C C C C C C
charge: -0.016064 -0.270569 -0.271928 -0.035241 -0.083640 0.128432 0.219504 0.213657 0.222935 -0.045830 -0.070276 -0.064006 -0.241910 0.158545 0.156392
polarizability: 2.10641638e+02 1.27838580e+00 1.71205359e+02 9.26708376e+00 -1.25202553e-01 8.96865332e+01
1716.lowfreq: -7.4527 -2.3111 -0.0006 -0.0006 0.0003 8.4665 41.3632 48.1884 52.9131
frequency: 41.3101 48.1575 52.8910 71.2267 107.8662 132.4371 142.8456 164.3927 177.2119 194.4590 200.6789 235.1450 254.3764 266.3662 280.2921 282.9321 326.4136 345.9372 356.0249 370.2048 422.2235 444.5118 508.4539 542.0863 572.2730 584.6975 600.8168 643.4224 716.1210 754.4764 813.7271 819.3460 828.2824 838.6379 847.5636 893.6917 935.8026 988.4246 996.1720 1061.8124 1102.5689 1104.2510 1111.7583 1112.4532 1136.7835 1155.7838 1156.5680 1176.7831 1193.6762 1224.1734 1248.4622 1257.3457 1295.8352 1329.9855 1372.9477 1387.1628 1387.9274 1401.1029 1436.4967 1445.2446 1450.1305 1461.4779 1468.4891 1468.7550 1469.2818 1471.4665 1474.3976 1482.0104 1569.6514 1597.0758 1636.1533 2962.2187 2963.1643 2977.4392 2996.0500 3012.4340 3051.0676 3052.3934 3066.8057 3075.5920 3096.4826 3125.8557 3126.2491 3187.8365 3190.6580 3423.8441 3551.9443
redmass: 5.3445 2.6893 3.8176 3.1373 3.6808 5.6375 4.9772 3.9633 3.9970 1.6764 1.1458 5.1187 1.1895 1.2894 1.9859 1.5769 3.5517 3.5513 3.3735 4.2853 2.8392 2.2018 6.3791 4.4658 4.1346 4.1161 3.7516 1.5277 3.3537 5.4864 1.5122 1.6076 4.7286 3.5193 3.3069 1.8564 1.8258 9.5691 1.4413 2.4924 2.0862 2.9709 1.2586 1.2653 2.3596 1.4205 1.5096 1.6615 2.5845 1.5359 1.3069 4.5603 1.3820 1.2590 1.3145 3.5415 1.4372 2.9461 1.2313 1.3094 1.1354 1.7856 1.0496 1.0539 1.0509 1.0601 1.0518 1.3165 7.5404 8.2819 1.0940 1.0328 1.0328 1.0382 1.0602 1.0847 1.1040 1.1041 1.1006 1.0974 1.1004 1.0996 1.0997 1.0915 1.0919 1.0443 1.0966
irintensity: 0.4548 0.2649 0.0694 9.5243 0.0273 0.9392 0.6083 5.4454 3.0173 0.1529 0.3013 4.8836 1.5119 38.7515 6.6675 0.2092 2.2795 6.7041 2.1930 5.1565 4.6361 2.9888 2.3982 0.6410 14.7522 0.3011 10.0519 353.7421 1.9306 48.8749 0.2365 64.0198 46.4508 15.6016 1.2174 1.5997 3.2711 0.3026 3.9165 116.3099 2.3441 141.4930 0.1729 0.1914 119.5515 15.4255 22.5288 99.0805 6.6040 19.6456 0.7012 1.4120 8.8600 8.3639 9.9208 121.0259 14.8741 24.7744 40.8198 18.2097 13.9670 50.9129 23.4009 2.7718 6.0919 7.5885 56.2198 4.4626 89.3437 168.8319 44.2066 75.1785 53.1241 21.9411 32.3185 12.0799 41.0595 44.2125 7.3151 49.9202 38.9493 20.8171 21.1970 1.8087 0.3796 2.8166 0.0900
temp: 298.150 k
press: 1.00000 atm
elementType: 35 8 8 7 6 6 6 6 6 6 6 6 6 6 6 1 1 1 1 1 1 1 1 1 1 1 1 1 1 1 1
symmnumber: 1
zpe: 659800.0 jmol-1
zpe.correction: 0.251305 hartree
zpe.thermalcorrener: 0.268357 hartree
zpe.thermalcorrenthalpy: 0.269301 hartree
zpe.thermalcorrgfe: 0.205690 hartree
zpe.sumelectzpe: -646.237182 hartree
zpe.sumelectthermal: -646.220130 hartree
zpe.sumelectthermalent: -646.219186 hartree
zpe.sumelectthermalfe: -646.282797 hartree
dipole: 0.0212 0.2163 -1.2914
dipole: 1.3095
quadrupole: -110.8306 -75.3436 -103.7852
quadrupole: -1.3461 6.7079 0.4470
quadrupole: -14.1775 21.3096 -7.1321 -1.3461 6.7079 0.4470
hfenergy: -646.4884868 hartree
pointgroup: C01 [X(C11H16Br1N1O2)]
dipole: 0.066196 -0.1472266 0.4892627 debye
polarizability: 205.1729365|-2.6178417|170.4442998|-25.3460543|11.2744578|95.9162946 unknown
InChI: InChI=1S/C11H16BrNO2/c1-7(13)4-9-10(14-2)5-8(12)6-11(9)15-3/h5-7H,4,13H2,1-3H3
charge 0 multiplicity 1
31 atoms
Br 4.225956 -0.312693 -1.170324
O  -0.13588 2.36724 0.527548
O  -0.586613 -2.36656 0.121411
N  -4.113693 0.92605 0.160175
C  -1.777335 0.122615 0.752076
C  -2.754732 0.657621 -0.361676
C  -0.335227 0.001942 0.304387
C  0.487527 1.15564 0.180153
C  0.254702 -1.250015 -0.021494
C  -2.860287 -0.314033 -1.552177
C  1.837488 1.084902 -0.252706
C  1.602167 -1.361942 -0.45697
C  2.356909 -0.182649 -0.561903
C  0.661801 3.593733 0.455188
C  -0.026091 -3.688647 -0.166391
H  -2.144436 -0.861484 1.094237
H  -1.83293 0.831809 1.599773
H  -2.347731 1.621934 -0.720365
H  -3.521306 0.111094 -2.326941
H  -3.280351 -1.286135 -1.227288
H  -1.868044 -0.510697 -1.993647
H  -4.134175 1.616929 0.919506
H  -4.619483 0.070467 0.421044
H  2.460987 1.975426 -0.346047
H  2.048862 -2.325974 -0.704894
H  1.003952 3.79042 -0.579249
H  1.535246 3.546831 1.134002
H  -0.017291 4.396078 0.778803
H  0.295238 -3.769468 -1.222843
H  -0.84738 -4.394737 0.024967
H  0.827046 -3.918697 0.500944
