program: Gaussian 09
title: 000158243
version: EM64L-G09RevD.01
frameworkgroup: C1[X(C16H25NO2)]
method: RPBEPBE
basis: SDD
operation: Freq
keyword: #p
keyword: freq=noraman
keyword: PBEPBE/SDD
title: #p freq=noraman PBEPBE/SDD
converged: YES YES NO NO
title: Mulliken charges:
elementType: O O N C C C C C C C C C C C C C C C C H H H H H H H H H H H H H H H H H H H H H H H H H
charge: -0.442488 -0.493051 -0.122047 0.026591 -0.467403 -0.623437 -0.524604 0.374794 0.141593 -0.311309 -0.394271 -0.391902 -0.377793 0.001105 -0.433201 0.127338 -0.374021 -0.694852 -0.685316 0.183372 0.204937 0.221655 0.233386 0.228163 0.224669 0.247116 0.171282 0.193333 0.216172 0.224014 0.216974 0.199994 0.211297 0.207969 0.233853 0.219276 0.207291 0.210396 0.218812 0.208236 0.207240 0.218290 0.385101 0.371445
chargesum: 0.00000
title: Mulliken charges with hydrogens summed into heavy atoms:
elementType: O O N C C C C C C C C C C C C C C C C
charge: -0.057387 -0.121606 -0.122047 0.209963 -0.040811 -0.161888 -0.052819 0.374794 0.141593 0.053307 0.045915 0.025066 0.041473 0.001105 -0.199349 0.127338 -0.154745 -0.058354 -0.051549
polarizability: 2.47918396e+02 -4.42105831e+00 1.94141692e+02 -6.20305208e+00 -8.93904101e+00 1.21882360e+02
1716.lowfreq: -3.0369 -0.0008 -0.0008 -0.0007 2.6533 10.3951 22.4752 36.0447 37.7229
frequency: 22.0581 35.9660 37.5568 58.4960 73.8781 85.2634 108.8600 131.7734 164.9726 186.1286 201.5166 217.4778 220.4367 232.0068 234.3301 247.2724 275.7109 287.6255 293.5276 309.1181 345.7767 364.1275 376.5959 431.3982 462.7429 488.4870 493.5727 501.3549 510.3812 537.7613 568.4895 589.3946 599.2049 657.5500 721.5810 735.8237 749.0120 756.9869 776.6004 797.8575 846.5436 864.3159 878.5633 887.4288 889.0162 893.2849 899.4551 920.3428 925.3700 1001.8454 1027.9771 1036.1579 1043.9031 1058.3761 1082.3170 1084.8912 1094.7958 1107.4665 1125.1492 1130.4948 1141.2675 1163.9937 1172.4124 1190.6019 1211.2855 1217.3377 1231.0067 1243.9034 1247.6215 1257.0634 1259.7119 1272.7331 1288.3509 1292.0883 1302.7874 1304.2006 1317.5907 1318.8930 1340.3170 1347.5167 1350.3879 1369.6500 1383.6345 1389.8194 1392.5212 1407.7796 1451.8545 1458.3262 1469.5925 1472.0204 1474.6552 1477.5745 1478.9824 1479.8619 1480.7256 1483.9545 1489.4227 1491.7408 1500.0620 1603.4981 1632.3978 2827.6156 2846.6956 2957.6561 2967.2292 2969.5083 2972.4973 2975.4605 2982.0503 2998.0294 3005.1370 3018.4358 3027.5992 3031.1758 3036.3572 3043.6558 3052.8832 3065.7758 3067.4874 3070.9658 3071.1994 3075.2001 3115.9633 3139.9835 3521.5219 3625.7760
redmass: 3.7583 3.5971 2.7439 3.0478 1.9727 2.4222 2.7043 3.1628 3.3241 3.5214 2.0138 2.3948 1.8460 1.2756 2.1166 1.1682 2.6253 4.3471 3.0739 3.5045 4.4415 2.6191 2.5880 3.1946 3.6666 4.1523 1.1259 3.4686 3.4873 3.7863 3.5831 3.9578 3.1871 4.5250 4.3581 1.2972 1.5986 1.6200 1.4062 2.1893 2.1349 1.3620 2.0857 1.4502 1.5691 2.2390 1.9195 1.5771 2.0880 3.0957 2.7850 3.0283 2.5684 2.4003 2.0367 2.0496 2.1274 2.6664 1.6159 1.4093 1.2469 1.8737 2.2380 2.0648 1.3322 1.9757 2.1038 1.3662 1.2728 1.3800 1.3717 2.3875 1.2064 1.2417 1.2655 1.3442 1.4820 1.3037 1.4741 1.5950 1.3592 1.4688 1.3603 1.2073 1.2968 4.7224 1.1996 1.1040 1.0793 1.0888 1.0723 1.0501 1.0506 1.1119 1.0773 3.0472 1.7395 1.1236 1.2518 7.5365 7.1558 1.0802 1.0718 1.0635 1.0674 1.0356 1.0356 1.0595 1.0607 1.0632 1.0625 1.0974 1.0907 1.0959 1.0916 1.0947 1.1006 1.0994 1.1011 1.1002 1.0996 1.0994 1.0870 1.0966 1.0647 1.0666
irintensity: 0.4882 0.2094 0.0636 0.3411 0.0030 0.3240 0.2010 1.4696 0.0356 1.9675 1.1383 2.4886 0.7156 0.7182 0.1932 176.5518 3.5517 5.8055 1.5779 4.8802 1.2328 1.0809 3.3446 5.8375 0.6378 4.6644 122.8925 2.1196 1.4280 4.8572 20.4125 4.6669 5.9552 2.9973 2.7055 5.3226 4.0288 9.2091 46.5722 4.1149 5.4578 8.0623 27.3787 4.8726 24.9346 6.5896 39.8186 11.4949 14.5704 22.8968 126.2786 1.3149 15.9064 13.3266 4.8900 4.4700 1.2127 41.1041 18.0870 59.7836 2.9029 10.6246 16.0661 10.6759 25.4988 6.9353 23.0990 41.1332 6.0297 79.4555 111.6660 85.3688 4.1248 5.2001 1.2352 1.9653 1.0300 4.1417 1.4320 11.0813 6.4970 9.0971 11.3760 17.4980 3.0283 8.8206 8.1351 13.8038 4.0446 10.5347 7.1612 6.8606 8.1153 13.0119 5.8104 78.0835 19.3708 16.5181 17.3443 10.6756 10.6037 42.5274 106.8060 21.2657 18.5848 48.3098 42.6314 14.3041 15.1727 26.1089 71.5609 8.1007 2.9180 24.4682 18.1018 26.6576 4.7263 30.1812 140.7066 15.9829 99.3190 69.1839 13.9860 18.4278 79.8279 54.4793
temp: 298.150 k
press: 1.00000 atm
elementType: 8 8 7 6 6 6 6 6 6 6 6 6 6 6 6 6 6 6 6 1 1 1 1 1 1 1 1 1 1 1 1 1 1 1 1 1 1 1 1 1 1 1 1 1
symmnumber: 1
zpe: 998949.8 jmol-1
zpe.correction: 0.380480 hartree
zpe.thermalcorrener: 0.400834 hartree
zpe.thermalcorrenthalpy: 0.401778 hartree
zpe.thermalcorrgfe: 0.330824 hartree
zpe.sumelectzpe: -828.404648 hartree
zpe.sumelectthermal: -828.384294 hartree
zpe.sumelectthermalent: -828.383350 hartree
zpe.sumelectthermalfe: -828.454304 hartree
dipole: -0.9096 2.2622 0.4038
dipole: 2.4715
quadrupole: -95.7683 -112.9395 -120.6267
quadrupole: -9.7683 1.7867 -1.0111
quadrupole: 14.0098 -3.1614 -10.8485 -9.7683 1.7867 -1.0111
hfenergy: -828.7851276 hartree
pointgroup: C01 [X(C16H25N1O2)]
dipole: 0.3847526 0.8741583 -0.1824254 debye
polarizability: 248.2343517|2.6372424|194.4339539|-4.7535286|6.867387|121.2741431 unknown
InChI: InChI=1S/C16H25NO2/c1-3-9-17(10-4-2)13-6-7-14-12(11-13)5-8-15(18)16(14)19/h5,8,13,18-19H,3-4,6-7,9-11H2,1-2H3
charge 0 multiplicity 1
44 atoms
O  3.798302 -2.14474 -0.463992
O  5.550126 -0.112288 -0.313065
N  -2.408881 -0.083469 0.421389
C  -0.977856 -0.260597 0.006762
C  -0.409723 -1.609827 0.520851
C  -0.067081 0.857525 0.568364
C  0.986568 -1.891325 -0.071519
C  1.419937 0.610916 0.320027
C  1.912325 -0.692537 0.033495
C  -3.32206 -1.020401 -0.289892
C  -2.914548 1.316877 0.424275
C  -4.743163 -1.090579 0.310158
C  -3.038153 2.03297 -0.953411
C  3.299231 -0.864525 -0.172789
C  2.322517 1.70058 0.391141
C  4.191272 0.231165 -0.0872
C  3.710641 1.522018 0.193966
C  -5.561464 -2.249872 -0.299791
C  -3.51574 3.491839 -0.788639
H  -0.885901 -0.254827 -1.1122
H  -1.076321 -2.452005 0.26623
H  -0.362394 -1.558538 1.625939
H  -0.255789 0.926575 1.660559
H  -0.331301 1.840125 0.136192
H  0.892403 -2.180578 -1.138967
H  1.45184 -2.761739 0.426798
H  -3.399173 -0.784166 -1.38303
H  -2.88821 -2.033938 -0.227266
H  -3.908143 1.314927 0.910369
H  -2.26875 1.92336 1.084012
H  -4.653685 -1.220108 1.406046
H  -5.285977 -0.140426 0.140592
H  -2.059733 2.015475 -1.47337
H  -3.748565 1.48361 -1.601867
H  1.936408 2.704022 0.604451
H  4.397515 2.375408 0.254015
H  -5.636339 -2.150716 -1.399665
H  -5.091838 -3.227685 -0.082337
H  -6.588903 -2.271428 0.106683
H  -4.497237 3.532204 -0.278422
H  -2.800664 4.079136 -0.181228
H  -3.622869 3.997994 -1.765343
H  4.785255 -2.080384 -0.56145
H  6.143417 0.671277 -0.230173
