program: Gaussian 09
title: 000158224
version: EM64L-G09RevD.01
frameworkgroup: C1[X(C19H28O5)]
method: RPBEPBE
basis: SDD
operation: Freq
keyword: #pfreq=noraman
keyword: PBEPBE/SDD
title: #p freq=noraman PBEPBE/SDD
converged: YES YES NO NO
title: Mulliken charges:
elementType: O O O O O C C C C C C C C C C C C C C C C C C C H H H H H H H H H H H H H H H H H H H H H H H H H H H H
charge: -0.268129 -0.277130 -0.276108 -0.253684 -0.224583 0.213221 0.358784 -0.395199 -0.495289 -0.370735 -0.555464 -0.005233 0.072879 -0.344137 -0.030097 0.028985 0.045738 -0.366892 -0.358811 -0.197563 -0.704009 -0.696736 -0.523098 -0.507916 0.191815 0.223072 0.252338 0.224285 0.219510 0.177199 0.258015 0.231567 0.192518 0.178333 0.217786 0.209410 0.197523 0.191343 0.243597 0.227403 0.221781 0.215837 0.212138 0.207815 0.213708 0.211245 0.230832 0.215376 0.254013 0.236429 0.249481 0.226834
chargesum: 0.00000
title: Mulliken charges with hydrogens summed into heavy atoms:
elementType: O O O O O C C C C C C C C C C C C C C C C C C C
charge: -0.268129 -0.277130 -0.276108 -0.253684 -0.224583 0.213221 0.358784 0.019688 -0.018666 0.025974 -0.065881 -0.005233 0.072879 0.026714 -0.030097 0.028985 0.045738 0.060303 0.030055 0.273437 -0.054253 -0.063967 0.177124 0.204828
polarizability: 2.98665689e+02 4.24478261e+00 2.50685447e+02 2.23732534e+01 5.96504553e+00 1.56476777e+02
1716.lowfreq: -5.7810 -3.2297 -0.0007 -0.0006 0.0000 3.3246 13.1827 15.4919 33.5742
frequency: 13.1729 15.3216 33.5147 35.9247 43.6299 44.3633 58.1491 77.0203 83.8127 91.5859 96.5949 110.3664 119.3629 128.2344 138.1202 145.9328 148.5723 158.2184 183.9825 209.5997 224.5383 229.6129 231.9371 234.5756 239.4479 269.7683 283.3537 299.8742 313.9054 327.0469 358.8739 370.6926 389.3264 402.3326 419.1493 464.5491 487.4349 509.4967 543.3865 578.3853 646.9316 657.9803 672.5956 683.4563 700.4404 725.7611 750.6346 757.2812 789.9413 824.1721 839.4404 853.2469 867.6588 869.6362 885.2541 888.6677 891.9704 916.1282 939.6834 959.9614 987.8913 997.9605 1010.9326 1022.9662 1038.6877 1050.9550 1074.5715 1079.0170 1082.1491 1089.2842 1102.1753 1106.9562 1109.8680 1110.7812 1112.4896 1141.7031 1144.3325 1155.4551 1165.1460 1188.4274 1204.0640 1221.6621 1235.6012 1252.3129 1262.8196 1280.0069 1285.7773 1287.0506 1291.4372 1300.7633 1311.5775 1336.5374 1342.9136 1350.2795 1357.9462 1362.2756 1375.5368 1384.5959 1387.7501 1388.0636 1416.7148 1421.1052 1433.5895 1449.0470 1451.7781 1455.4633 1459.4126 1461.2179 1462.5144 1466.2650 1467.7869 1471.2010 1474.4030 1476.7939 1477.9325 1479.4655 1480.2402 1485.3075 1487.0536 1572.1590 1584.9748 1615.1834 2950.8094 2955.3002 2966.1586 2970.5773 2971.0057 2971.8498 2975.5970 2977.8372 2979.9359 2986.9498 2992.1017 2993.9571 3010.7084 3025.2318 3027.6227 3032.3829 3033.5276 3053.4854 3067.0997 3069.0105 3069.2230 3071.9863 3075.5016 3100.1562 3101.4175 3121.9904 3123.7249 3135.5482
redmass: 4.1959 4.1978 1.7789 3.2818 3.9508 3.0356 3.2444 2.6022 3.6830 1.7495 2.6946 3.2356 2.0068 3.0210 2.0744 2.3408 2.3570 1.9162 2.0378 2.5126 1.4017 1.1782 2.1309 4.3690 2.8575 3.8616 4.1181 3.2873 4.3249 4.6649 3.8922 3.1528 5.6174 6.2161 5.4882 2.9933 5.3679 7.3405 4.1715 5.1718 3.6473 6.6595 6.0135 2.5914 8.0338 1.0999 1.1557 1.3949 5.5555 2.9552 2.6843 3.5626 2.4716 1.9504 2.0135 1.9152 2.5909 4.8331 6.7504 1.4050 3.9984 7.5064 2.9099 3.7905 2.8870 2.9567 2.0703 1.9691 1.5433 2.1014 2.4622 1.9168 1.3180 1.5863 1.4439 2.1984 1.1163 1.4365 1.7065 1.4211 1.5681 3.7981 1.4362 1.2857 1.3216 2.0697 1.0802 1.3181 1.1590 1.5617 1.3373 1.4167 1.6494 1.5592 1.5959 1.3307 4.6347 1.2143 3.8028 1.3365 2.3403 1.1402 1.2641 1.3051 1.0873 1.1005 1.2377 1.1283 1.0707 1.0495 1.0765 1.0678 1.0464 1.0425 1.0756 1.1061 1.0578 1.0677 1.0820 8.2574 9.3997 9.9391 1.0592 1.0613 1.0594 1.0368 1.0333 1.0352 1.0624 1.0592 1.0648 1.0655 1.0920 1.0306 1.0978 1.0936 1.1008 1.0681 1.0984 1.1016 1.1006 1.0996 1.0993 1.1003 1.1002 1.1034 1.1018 1.1035 1.1052 1.1046
irintensity: 0.4499 0.2400 0.5334 0.6917 0.0691 3.2149 2.7867 3.8821 5.8341 0.5918 3.0636 0.4311 0.2656 0.0665 3.5460 2.3145 9.8156 1.5484 1.4067 0.9362 0.1846 0.3396 2.3380 4.8040 0.7847 1.6288 1.1577 3.6898 5.3004 9.9746 0.3078 11.0486 8.2744 0.4496 0.8050 9.6402 0.6951 2.1961 2.1980 5.5404 4.3503 1.3248 3.2554 0.7667 3.1269 11.2401 19.0760 1.0745 7.4114 7.5163 31.9318 26.5378 12.2153 3.5429 3.4960 1.8093 7.4162 59.9631 17.8593 1.7517 8.2076 254.8353 21.3934 20.1105 5.5531 3.5995 0.9611 0.3922 17.7285 17.9618 115.1108 5.8192 1.4079 30.6283 11.4181 25.4308 3.2222 5.9459 93.9451 3.9273 3.2062 90.3752 24.0914 2.1735 7.8871 171.1260 3.6390 4.4233 19.0912 79.5244 8.1526 4.3690 55.2868 2.1889 0.1781 6.7822 158.9209 9.6411 48.5578 4.6244 11.2773 64.8114 38.8667 2.9074 21.9439 24.4742 7.7624 12.9451 0.7824 34.1752 1.2279 0.6347 9.8300 11.9406 4.4086 1.9157 12.4255 15.1596 16.3493 145.1847 79.7520 125.2913 4.2831 15.9057 74.4915 44.9234 64.5738 63.8216 61.0256 12.0976 111.1468 15.8711 16.5103 62.8660 5.1077 8.1108 24.2336 38.0930 17.1130 49.5713 105.3741 43.4042 54.0574 47.9382 32.9768 29.7579 5.5387 20.2655 23.7461 19.4691
temp: 298.150 k
press: 1.00000 atm
elementType: 8 8 8 8 8 6 6 6 6 6 6 6 6 6 6 6 6 6 6 6 6 6 6 6 1 1 1 1 1 1 1 1 1 1 1 1 1 1 1 1 1 1 1 1 1 1 1 1 1 1 1 1
symmnumber: 1
zpe: 1139951.7 jmol-1
zpe.correction: 0.434185 hartree
zpe.thermalcorrener: 0.461794 hartree
zpe.thermalcorrenthalpy: 0.462738 hartree
zpe.thermalcorrgfe: 0.372514 hartree
zpe.sumelectzpe: -1115.008798 hartree
zpe.sumelectthermal: -1114.981188 hartree
zpe.sumelectthermalent: -1114.980244 hartree
zpe.sumelectthermalfe: -1115.070469 hartree
dipole: -3.7325 -3.2482 -2.0717
dipole: 5.3642
quadrupole: -132.2958 -132.4064 -147.7066
quadrupole: 3.3040 -0.9046 6.1193
quadrupole: 5.1738 5.0632 -10.2370 3.3040 -0.9046 6.1193
hfenergy: -1115.4429825 hartree
pointgroup: C01 [X(C19H28O5)]
dipole: 1.6504727 0.9760139 -0.8815965 debye
polarizability: 300.4199117|-4.1228121|248.2370219|-17.386854|-14.5367448|157.1709788 unknown
InChI: InChI=1S/C19H28O5/c1-5-7-8-9-11-14(20)15-13(10-6-2)16(21-3)18(22-4)19-17(15)23-12-24-19/h5-12H2,1-4H3
charge 0 multiplicity 1
52 atoms
O  1.216009 2.527699 0.208099
O  3.454576 1.916335 -0.305248
O  2.444693 -2.922862 0.345044
O  4.367362 -1.063356 -0.29539
O  -1.747153 -0.016472 1.855548
C  0.354316 0.183688 0.667715
C  0.774575 -1.200892 0.736318
C  -3.110907 2.050034 0.508788
C  -1.574972 1.935905 0.421784
C  -3.855272 1.079695 -0.437148
C  -0.197619 -2.326466 1.059458
C  1.336947 1.104536 0.252972
C  -1.030922 0.639739 1.0414
C  -5.391707 1.205426 -0.338016
C  2.106766 -1.553874 0.395085
C  2.662226 0.748781 -0.061055
C  3.091417 -0.585428 -0.009886
C  -1.082274 -2.702305 -0.164484
C  -6.14629 0.241404 -1.281837
C  2.452706 2.995562 -0.455809
C  -2.077439 -3.831749 0.173164
C  -7.681314 0.363686 -1.166947
C  3.447587 -3.378305 1.333626
C  5.278782 -0.214403 -1.090837
H  -3.405479 3.091994 0.269964
H  -3.426697 1.850506 1.550289
H  -1.095061 2.780704 0.956434
H  -1.225762 2.023032 -0.625274
H  -3.561405 0.039004 -0.194936
H  -3.538506 1.26773 -1.485353
H  -0.851469 -2.030878 1.893834
H  0.378761 -3.220957 1.349991
H  -5.704922 1.010953 0.708888
H  -5.693468 2.250133 -0.564822
H  -0.427227 -3.011198 -1.002308
H  -1.640573 -1.807235 -0.503487
H  -5.838567 -0.800231 -1.056782
H  -5.834996 0.43774 -2.328535
H  2.816572 3.898099 0.055545
H  2.245907 3.155979 -1.533038
H  -2.755344 -3.5256 0.991692
H  -2.698021 -4.096554 -0.702882
H  -1.544718 -4.745191 0.498721
H  -8.016652 1.389147 -1.413368
H  -8.197636 -0.334713 -1.851335
H  -8.019139 0.140103 -0.137273
H  3.540011 -4.462874 1.170111
H  3.091202 -3.18066 2.363387
H  4.417661 -2.881617 1.163189
H  6.160976 -0.847003 -1.267621
H  5.556928 0.697709 -0.538147
H  4.808529 0.0615 -2.05153
