program: Gaussian 09
title: 000013857
version: EM64L-G09RevD.01
frameworkgroup: C1[X(C6H7NO)]
method: RPBEPBE
basis: SDD
operation: Freq
keyword: #pfreq=noraman
keyword: PBEPBE/SDD
title: #p freq=noraman PBEPBE/SDD
converged: NO NO NO YES
title: Mulliken charges:
elementType: O N C C C C C C H H H H H H H
charge: -0.357706 0.044228 0.410620 -0.308267 -0.307982 -0.786293 -0.211679 -0.211689 0.236114 0.236101 0.229105 0.229062 0.241383 0.278500 0.278501
chargesum: 0.00000
title: Mulliken charges with hydrogens summed into heavy atoms:
elementType: O N C C C C C C
charge: -0.357706 0.044228 0.410620 -0.072153 -0.071881 -0.086742 0.066821 0.066812
polarizability: 1.17337474e+02 -4.18009777e-03 7.64044041e+01 3.83585761e-01 1.98911038e-04 3.47607631e+01
1716.lowfreq: -11.2809 -8.2921 -0.0009 -0.0002 0.0002 19.7408 27.7470 129.9593 301.2826
frequency: 26.7830 129.9592 301.2816 309.5716 416.0633 455.6796 456.8701 501.4549 652.8342 692.4994 749.8389 818.4499 819.7076 829.3214 928.4359 950.3129 981.5236 1017.4352 1043.6626 1093.0017 1179.6494 1231.9931 1246.5134 1278.8680 1307.3566 1400.6030 1440.0356 1466.2930 1472.0929 1472.6283 1523.5426 1632.0187 2973.2613 3054.6267 3087.5998 3144.9924 3147.6069 3206.8200 3210.8448
redmass: 1.0355 4.6979 2.9514 4.1257 2.9623 5.0839 6.6277 2.5801 6.9018 3.1795 4.4286 1.2566 1.5880 6.0582 1.2754 1.3455 1.4564 2.8753 1.5211 1.3866 1.1898 2.5409 6.7954 4.2054 1.2786 1.2188 2.2992 1.8932 1.3845 1.1969 4.2588 6.0232 1.0395 1.0940 1.0998 1.0911 1.0912 1.0945 1.0970
irintensity: 0.6155 1.4368 0.4335 9.1166 0.0023 5.4633 3.8357 22.2983 0.0839 1.0410 14.8869 0.0046 82.4487 1.2068 1.3937 0.0066 0.7544 7.1996 16.5489 12.4159 33.7763 0.2245 90.3223 6.8032 0.0499 8.1120 0.6586 73.9117 10.2174 32.3244 6.2672 2.3608 33.7348 21.2264 16.9770 14.0871 4.6979 0.2713 0.0184
temp: 298.150 k
press: 1.00000 atm
elementType: 8 7 6 6 6 6 6 6 1 1 1 1 1 1 1
symmnumber: 1
zpe: 308947.8 jmol-1
zpe.correction: 0.117672 hartree
zpe.thermalcorrener: 0.124820 hartree
zpe.thermalcorrenthalpy: 0.125764 hartree
zpe.thermalcorrgfe: 0.085321 hartree
zpe.sumelectzpe: -362.173709 hartree
zpe.sumelectthermal: -362.166561 hartree
zpe.sumelectthermalent: -362.165617 hartree
zpe.sumelectthermalfe: -362.206060 hartree
dipole: 4.8840 -0.0004 0.0407
dipole: 4.8842
quadrupole: -55.7599 -39.1814 -49.5175
quadrupole: -0.0013 0.1985 0.0000
quadrupole: -7.6070 8.9716 -1.3646 -0.0013 0.1985 0.0000
hfenergy: -362.2913807 hartree
pointgroup: C01 [X(C6H7N1O1)]
dipole: 1.9215555 0.0002231 -0.0085179 debye
dipolederiv: -1.2375289 -0.0000011 -0.0038923 -0.0000231 -0.3261619 0. -0.007929 -0.0000007 -0.3422415 1.2061266 -0.0000003 0.0094743 0.000045 0.0304492 0.0000005 0.0148412 0.0000027 0.114332 0.2981922 0.0001246 -0.0168525 0.0003846 -0.1912748 0. -0.1036237 -0.0000001 -0.0539153 -0.0002719 0.0716998 0.0014715 -0.1142542 0.1382673 0.0058753 0.0105889 0.0072648 -0.1127514 -0.0002963 -0.0716513 0.0014587 0.1141989 0.1383656 -0.0058953 0.0105836 -0.0073028 -0.1127745 -0.1083477 -0.0001182 0.0080959 -0.0007343 0.0694718 0.0000038 0.1280298 0.000034 0.0717686 -0.1710283 -0.0295933 -0.0013835 0.3326563 0.0690091 -0.0025875 0.003845 -0.002068 -0.1386323 -0.1710756 0.0296162 -0.0013855 -0.332594 0.0689967 0.0025835 0.003858 0.0020682 -0.1386411 0.0586554 0.0947415 -0.0037426 0.0769798 -0.0386404 -0.0007563 -0.0049458 0.0037307 0.1500601 0.0587026 -0.0947152 -0.0037286 -0.0769801 -0.0386597 0.0007638 -0.0049394 -0.00372 0.150037 0.0187371 -0.0249032 -0.0216939 -0.0999231 -0.0600291 -0.102057 -0.0780622 -0.0789109 0.065167 0.0190408 0.0248982 -0.0214975 0.1004035 -0.0608797 0.1015164 -0.0775561 0.0784403 0.065915 -0.0476647 -0.0001063 0.0566351 -0.0001421 0.1197982 0.0005475 0.1139687 0.0004568 -0.0951474 0.0383774 -0.0508757 -0.001479 -0.011104 0.0406396 0.0004386 -0.0043298 0.0015169 0.1884136 0.0383813 0.0508845 -0.0014801 0.0110869 0.0406483 -0.0004334 -0.0043292 -0.0015119 0.1884104 unknown
polarizability: 117.3392104|0.0052338|76.4044044|-0.0610223|-0.0004694|34.7590264 unknown
InChI: InChI=1S/C6H7NO/c1-6-2-4-7(8)5-3-6/h2-5H,1H3
charge 0 multiplicity 1
15 atoms
O  -2.793237 -0.00004 -0.021479
N  -1.46045 -0.000043 -0.010051
C  1.408051 -0.000001 0.017801
C  0.655154 -1.204572 0.012805
C  0.655106 1.204571 0.012764
C  2.922337 0.000085 -0.002367
C  -0.743553 -1.197738 -0.000911
C  -0.743577 1.197699 -0.000948
H  1.161589 -2.175874 0.021035
H  1.161528 2.175884 0.020961
H  3.333338 0.892555 0.501438
H  3.333367 -0.894562 0.497503
H  3.308483 0.002413 -1.040756
H  -1.368229 -2.092012 -0.002515
H  -1.368308 2.091934 -0.00258
