program: Gaussian 09
title: 000158223
version: EM64L-G09RevD.01
frameworkgroup: C1[X(C18H19NO3)]
method: RPBEPBE
basis: SDD
operation: Freq
keyword: #p
keyword: freq=noraman
keyword: PBEPBE/SDD
title: #p freq=noraman PBEPBE/SDD
converged: NO YES NO NO
title: Mulliken charges:
elementType: O O O N C C C C C C C C C C C C C C C C C C H H H H H H H H H H H H H H H H H H H
charge: -0.316046 -0.410488 -0.330029 -0.253660 -0.267633 0.079704 -0.675247 0.251570 0.171041 -0.517818 -0.475716 0.377745 0.121121 0.057031 -0.076778 -0.010353 -0.459541 -0.367333 -0.247935 -0.263000 -0.525832 -0.522037 0.251291 0.252238 0.216109 0.226651 0.241966 0.244082 0.230281 0.221372 0.237535 0.287706 0.224754 0.224155 0.376644 0.232298 0.247350 0.227623 0.228639 0.224362 0.266176
chargesum: 0.00000
title: Mulliken charges with hydrogens summed into heavy atoms:
elementType: O O O N C C C C C C C C C C C C C C C C C C
charge: -0.316046 -0.033844 -0.330029 -0.009578 -0.016341 0.079704 -0.206899 0.251570 0.171041 -0.049202 -0.024062 0.377745 0.121121 0.057031 -0.076778 -0.010353 -0.222006 -0.079628 -0.023181 -0.038845 0.181440 0.197140
polarizability: 2.90781469e+02 1.19274614e+01 2.42904234e+02 3.05411849e-01 9.82320925e+00 1.20023073e+02
1716.lowfreq: -4.6288 -0.0009 -0.0006 -0.0004 2.3822 10.1060 48.8010 53.4720 75.8214
frequency: 48.7770 53.4053 75.7694 89.5354 97.4000 112.6109 140.3327 143.6287 164.0101 164.9443 206.5957 218.3016 235.0902 256.8191 274.4262 302.0953 303.9479 317.6949 335.6762 366.3394 386.6246 397.0852 411.5149 438.8464 455.0070 503.3843 519.3841 535.2549 553.0373 581.4736 592.0779 596.0352 633.1170 662.7164 678.7442 697.6336 732.8710 746.3095 763.5367 774.9765 793.4443 796.5487 839.2291 881.8250 882.8569 902.7240 929.0464 951.8650 954.5514 987.0982 988.0435 990.1907 1017.0907 1044.0123 1058.7624 1083.6261 1103.2279 1113.3634 1116.8892 1118.3468 1131.6679 1149.5180 1154.2100 1159.6750 1167.5588 1176.8047 1195.8585 1207.7374 1218.7327 1230.7537 1238.7602 1288.0186 1300.9855 1305.2980 1321.1316 1334.4885 1340.3873 1354.4408 1367.9332 1370.9629 1406.7828 1420.8489 1431.9430 1444.1296 1446.2901 1449.4242 1455.8577 1457.0480 1460.5192 1461.9855 1462.7319 1474.7556 1486.7759 1491.0384 1575.7816 1585.4247 1599.6127 1612.2059 2933.1264 2949.3691 2965.0616 2972.1489 2979.5623 2991.3573 3025.9110 3053.1294 3057.4006 3069.7905 3085.0183 3116.2179 3117.4571 3126.8363 3130.2193 3153.6833 3187.5333 3393.4407 3453.9571
redmass: 4.4833 3.0866 3.4656 3.3405 3.2715 3.2769 3.0363 4.4036 1.0843 1.1389 3.2921 3.4053 4.3024 3.7975 4.7511 3.4083 3.4960 6.8136 4.6084 4.8144 5.2250 5.3602 4.4650 4.0295 3.1515 4.0759 4.9488 3.8497 3.6906 3.3626 1.1653 4.6084 5.4412 5.7769 4.3042 2.2574 3.0346 2.7335 1.8796 4.5002 3.8782 3.6296 3.3945 1.4072 2.8469 3.5571 4.8589 2.7741 1.4650 2.6177 2.4396 1.3605 6.4633 2.3449 3.5272 2.3348 2.5708 1.2666 1.7945 1.3930 3.2861 1.5624 1.4355 1.9439 1.4425 1.1282 1.3580 1.4553 2.1085 2.1085 1.5112 1.5708 1.4587 1.6051 1.9126 1.8492 2.4379 1.4983 2.8592 5.6338 2.3857 1.8930 1.5617 1.1653 1.9973 2.0593 1.0652 1.1292 1.0588 1.2339 1.1736 1.0630 1.0549 2.8006 6.5193 9.2900 7.4401 6.5822 1.0733 1.0763 1.0653 1.0297 1.0315 1.0629 1.0929 1.0924 1.1041 1.1053 1.1019 1.0865 1.1026 1.1046 1.0901 1.0982 1.0943 1.0736 1.0636
irintensity: 0.0166 2.8886 2.2601 4.4006 0.7644 2.4212 2.7982 0.6006 0.0139 0.0510 2.7756 0.6367 0.6871 14.3284 5.6902 1.1938 13.0719 8.0032 4.6420 1.8730 3.7712 2.7182 4.3705 8.4977 8.0379 2.6795 1.6822 5.7740 7.7385 5.1674 117.9239 7.8787 19.0304 0.8204 14.4450 58.6038 92.8116 10.9070 59.8794 17.3233 3.9725 5.6237 7.9184 1.3766 6.1620 11.8251 36.1092 12.8652 2.2797 19.1476 25.5660 1.5394 80.6300 19.4485 73.2487 9.5454 32.6078 2.1247 12.9830 4.4975 14.5178 5.1419 5.5611 21.5087 9.4761 1.4045 7.1771 114.9384 32.0519 9.9563 37.4156 6.3033 5.8212 22.7398 2.3636 7.7134 113.8796 6.2508 40.9279 1.7364 26.3298 59.3391 38.1586 18.7187 5.2706 37.1039 13.8173 10.6326 4.2129 0.3797 26.7030 5.2098 21.7749 12.9469 7.5407 48.7079 1.1959 0.5048 7.9793 41.7712 25.3002 60.3837 72.2113 52.2333 32.3486 24.0113 46.0734 25.0855 23.3071 5.7898 21.0396 19.0578 20.5164 42.4187 7.8246 1.7673 89.1029
temp: 298.150 k
press: 1.00000 atm
elementType: 8 8 8 7 6 6 6 6 6 6 6 6 6 6 6 6 6 6 6 6 6 6 1 1 1 1 1 1 1 1 1 1 1 1 1 1 1 1 1 1 1
symmnumber: 1
zpe: 870995.5 jmol-1
zpe.correction: 0.331745 hartree
zpe.thermalcorrener: 0.351163 hartree
zpe.thermalcorrenthalpy: 0.352107 hartree
zpe.thermalcorrgfe: 0.285046 hartree
zpe.sumelectzpe: -976.119776 hartree
zpe.sumelectthermal: -976.100358 hartree
zpe.sumelectthermalent: -976.099414 hartree
zpe.sumelectthermalfe: -976.166475 hartree
dipole: 1.4761 -2.0803 0.6946
dipole: 2.6437
quadrupole: -122.1448 -120.1264 -126.6614
quadrupole: -4.9007 -4.3905 2.4483
quadrupole: 0.8328 2.8511 -3.6839 -4.9007 -4.3905 2.4483
hfenergy: -976.4515208 hartree
pointgroup: C01 [X(C18H19N1O3)]
dipole: -0.4856811 -0.877848 -0.2743976 debye
polarizability: 292.6795798|-6.3891405|240.7618875|4.1625413|-10.7570795|120.2673085 unknown
InChI: InChI=1S/C18H19NO3/c1-21-17-15-11-6-4-3-5-10(11)9-13-14(15)12(7-8-19-13)16(20)18(17)22-2/h3-6,13,19-20H,7-9H2,1-2H3
charge 0 multiplicity 1
41 atoms
O  -0.231449 -2.672432 -0.072454
O  -3.973593 0.42242 -0.189371
O  -3.052354 -2.125699 -0.213022
N  0.045297 3.586066 -0.238749
C  0.64006 2.289743 0.16337
C  -0.328379 1.094475 0.072969
C  1.894832 1.992569 -0.676143
C  -1.722554 1.335467 -0.016206
C  0.222952 -0.231689 0.080591
C  -2.318271 2.737335 -0.023972
C  -1.277423 3.802408 0.396864
C  2.541309 0.701535 -0.207442
C  1.703543 -0.395452 0.175184
C  -0.684671 -1.326705 -0.02919
C  -2.589596 0.22144 -0.10038
C  -2.078406 -1.095849 -0.085801
C  3.945823 0.579791 -0.127854
C  2.324733 -1.582721 0.656623
C  4.549924 -0.612622 0.330528
C  3.72945 -1.691493 0.730288
C  -0.333694 -3.287964 -1.416871
C  -3.10346 -3.082583 0.922214
H  0.957148 2.392017 1.224147
H  2.597179 2.840998 -0.597803
H  1.59428 1.907911 -1.744279
H  -2.698361 2.964901 -1.041523
H  -3.206683 2.765054 0.635302
H  -0.026186 3.644991 -1.267366
H  -1.637639 4.816827 0.147315
H  -1.125091 3.769627 1.492886
H  4.570467 1.432281 -0.421456
H  1.696739 -2.419321 0.967931
H  5.641299 -0.692054 0.388485
H  4.181031 -2.616569 1.106529
H  -4.390794 -0.478884 -0.28413
H  0.306276 -2.742705 -2.135195
H  -1.383369 -3.286816 -1.764175
H  0.030065 -4.320304 -1.298776
H  -3.892446 -3.804699 0.662038
H  -3.362618 -2.551795 1.857653
H  -2.129771 -3.588302 1.032742
