program: Gaussian 09
title: 000158215
version: EM64L-G09RevD.01
frameworkgroup: C1[X(C18H21ClN6O2)]
method: RPBEPBE
basis: SDD
operation: Freq
keyword: #p
keyword: freq=noraman
keyword: PBEPBE/SDD
title: #p freq=noraman PBEPBE/SDD
converged: YES YES NO NO
title: Mulliken charges:
elementType: Cl O O N N N N N N C C C C C C C C C C C C C C C C C C H H H H H H H H H H H H H H H H H H H H H
charge: -0.079805 -0.329287 -0.213559 -0.151027 -0.438603 -0.066700 -0.026086 -0.443902 -0.628644 0.193381 -0.602073 -0.477273 0.453369 -0.114831 0.434105 -0.571047 0.045874 -0.655817 0.257208 -0.364667 -0.332105 -0.217586 -0.230846 -0.119958 0.259147 -0.213047 -0.675370 0.262175 0.231027 0.225256 0.250193 0.302188 0.218207 0.228661 0.236816 0.223909 0.242058 0.270303 0.333934 0.334770 0.330515 0.247769 0.251153 0.227317 0.226653 0.211372 0.227142 0.227735
chargesum: 0.00000
title: Mulliken charges with hydrogens summed into heavy atoms:
elementType: Cl O O N N N N N N C C C C C C C C C C C C C C C C C C
charge: -0.079805 -0.329287 -0.213559 -0.151027 -0.136415 -0.066700 -0.026086 -0.109968 0.036641 0.193381 -0.108872 -0.001824 0.453369 -0.114831 0.434105 -0.352840 0.045874 0.033568 0.257208 -0.122609 -0.061802 0.030183 0.020307 -0.119958 0.259147 0.240923 -0.009121
polarizability: 4.16415717e+02 2.98425871e+01 2.47741785e+02 1.64409912e+01 2.46691398e+01 2.04491194e+02
1716.lowfreq: -6.5697 -0.0021 -0.0017 0.0005 0.5425 2.2254 11.7696 14.7243 22.0475
frequency: 11.5678 14.6558 21.9198 29.2635 38.4497 50.3230 61.6183 65.4479 76.4590 92.2612 100.1083 136.0787 140.1002 163.1808 175.1269 186.9565 212.7189 223.7205 223.7819 233.7945 248.3912 254.6465 299.7572 302.2602 308.8468 324.3477 343.4396 367.9561 377.1235 418.0717 437.0811 443.7514 473.9574 484.4198 488.0916 502.4190 510.5414 529.8485 550.3136 575.0914 587.0126 611.0306 619.1792 627.1622 651.6212 657.9487 668.4412 671.3699 696.7943 704.7103 729.2662 746.8213 757.9798 795.9845 796.8312 801.2435 808.0816 814.6958 845.0555 869.3884 910.8692 920.1102 925.8298 947.1955 959.7617 976.1571 982.6637 1018.0680 1041.4168 1050.7360 1079.3902 1083.5270 1109.7741 1111.3569 1114.9294 1123.0200 1134.8746 1140.4128 1148.3364 1194.0490 1200.7307 1206.5963 1214.5139 1227.0135 1246.3402 1250.0682 1254.3191 1305.5682 1310.9151 1325.2003 1348.5778 1362.4460 1364.3285 1373.8900 1385.1036 1399.0496 1415.9035 1442.1073 1452.2865 1463.5925 1464.0035 1468.3954 1471.1331 1477.2751 1479.5124 1489.8644 1493.9475 1495.6246 1506.4922 1508.9464 1567.5164 1571.4772 1595.0786 1608.8558 1609.6573 1614.6982 1699.5310 2892.1953 2937.0193 2971.0177 2994.1824 2997.5568 2999.7653 3005.0674 3028.4636 3062.0928 3091.3628 3092.9968 3104.4410 3127.7252 3152.3275 3155.9852 3172.4279 3177.1781 3537.4895 3553.0464 3568.5778 3699.0872
redmass: 7.0228 5.2745 4.0841 6.5089 3.4735 3.7626 4.5882 3.0685 3.7633 3.1504 4.1039 3.9937 5.2966 5.3584 4.1412 4.7333 1.5655 3.9587 3.0097 4.3730 4.4701 1.3009 4.1130 6.5856 5.6294 4.5042 4.3647 3.3372 3.7495 3.0504 1.5210 2.7003 4.0165 1.3864 4.5435 2.6371 3.1351 3.1985 6.2731 4.7615 1.0877 4.6498 1.9375 6.7645 2.6103 4.3725 5.8431 5.4547 3.1971 5.1611 4.9899 5.3119 2.8493 2.6675 1.4373 1.0953 4.5821 1.6031 5.4127 3.9326 3.5590 1.8788 1.3553 1.3432 2.9337 3.5159 4.4166 1.8902 2.8892 3.2012 2.6813 3.7345 1.3112 1.7431 2.2782 1.5450 3.1244 1.4694 2.6244 1.5498 1.2033 1.2781 1.9297 2.7199 1.9531 1.1293 2.1787 1.4460 1.7192 1.6095 1.7277 1.8367 2.0576 5.5496 5.5874 1.2782 2.9187 1.1888 3.4001 1.0408 1.1776 1.1714 1.2799 1.0791 1.9562 1.1626 1.7865 1.9982 1.3284 2.1684 2.0071 7.2045 4.3602 7.3676 2.9182 5.2937 9.3335 1.0705 1.0382 1.0590 1.0357 1.0941 1.0955 1.0580 1.1019 1.1067 1.0986 1.0948 1.1024 1.0923 1.0877 1.0883 1.0957 1.0965 1.0434 1.0759 1.0772 1.1057
irintensity: 0.3549 1.8773 0.1650 0.0145 0.4719 0.6611 0.6747 2.4002 1.2265 0.8657 0.6740 6.3461 2.7840 9.0246 1.4297 3.1755 5.9429 3.6196 2.5727 9.9150 5.1831 3.0135 0.4438 3.9161 1.7581 24.9770 3.5397 1.6755 4.9790 0.0601 81.3173 23.3640 10.8512 89.4699 5.6727 28.3100 69.9296 68.8452 4.5994 3.6922 17.0549 24.1401 4.5378 1.1537 59.2479 8.9043 1.6206 1.3411 1.4544 37.0958 25.6568 14.3801 24.6329 83.7906 17.7550 6.5310 3.6581 86.9820 7.6635 0.4740 17.3234 17.4263 1.2335 0.2615 55.8116 194.2275 15.7077 17.2446 229.8789 81.7799 19.7204 380.5678 3.8592 29.6655 20.7296 2.4181 26.7462 4.7187 255.3656 2.4687 9.4535 26.6216 49.2876 83.1134 39.7686 0.0261 96.7052 9.8359 18.5724 97.4113 39.2915 31.5081 23.6398 4.6043 101.5427 24.2270 11.6301 12.2300 174.4998 11.6200 14.0349 9.5843 41.3581 30.9273 25.7302 72.8465 17.0428 163.8451 242.0859 837.9635 102.6862 0.8423 358.8831 318.9496 312.5460 183.4856 287.8114 100.1684 99.3859 45.0807 27.6140 58.4392 32.7603 29.0941 11.9128 10.3698 35.4086 25.2533 48.2226 16.2033 6.3264 2.0326 13.8937 0.4610 80.4798 37.0774 23.9648 58.9106
temp: 298.150 k
press: 1.00000 atm
elementType: 17 8 8 7 7 7 7 7 7 6 6 6 6 6 6 6 6 6 6 6 6 6 6 6 6 6 6 1 1 1 1 1 1 1 1 1 1 1 1 1 1 1 1 1 1 1 1 1
symmnumber: 1
zpe: 986449.9 jmol-1
zpe.correction: 0.375719 hartree
zpe.thermalcorrener: 0.402250 hartree
zpe.thermalcorrenthalpy: 0.403194 hartree
zpe.thermalcorrgfe: 0.314553 hartree
zpe.sumelectzpe: -1635.576995 hartree
zpe.sumelectthermal: -1635.550465 hartree
zpe.sumelectthermalent: -1635.549520 hartree
zpe.sumelectthermalfe: -1635.638162 hartree
dipole: -0.1737 -6.2883 -3.6068
dipole: 7.2514
quadrupole: -160.1498 -161.1176 -155.0762
quadrupole: 24.1424 -11.5190 8.6235
quadrupole: -1.3686 -2.3364 3.7050 24.1424 -11.5190 8.6235
hfenergy: -1635.9527144 hartree
pointgroup: C01 [X(C18H21Cl1N6O2)]
dipole: 0.1278576 2.672894 -0.9891149 debye
polarizability: 415.8804441|22.2167119|251.8555861|-29.9927119|-17.2282581|200.9126662 unknown
InChI: InChI=1S/C18H21ClN6O2/c1-3-27-18(26)24-15-8-14-16(17(20)23-15)22-12(9-21-14)10-25(2)13-6-4-11(19)5-7-13/h4-8,21,24H,3,9-10,20H2,1-2H3
charge 0 multiplicity 1
48 atoms
Cl 5.792431 -4.093083 -1.7129
O  -6.696871 -0.269103 -0.445687
O  -5.521891 -1.194126 1.377706
N  4.185795 1.504002 0.030829
N  -0.073831 2.086736 -1.104554
N  0.849411 0.772992 1.211021
N  -2.713591 -0.320671 1.180288
N  -4.51512 0.22972 -0.27024
N  -0.958424 -0.844052 2.636241
C  1.707056 1.440342 0.474339
C  3.106106 1.700518 1.016934
C  1.386594 1.944834 -0.937404
C  -0.968905 1.292205 -0.399343
C  -0.473578 0.604602 0.752047
C  4.551274 0.206999 -0.372804
C  -2.338321 1.175653 -0.737787
C  -1.392301 -0.184234 1.512498
C  4.981953 2.653915 -0.415437
C  -3.15225 0.350964 0.088739
C  5.650725 -0.002001 -1.263155
C  3.841151 -0.945848 0.093074
C  6.025333 -1.300162 -1.667251
C  4.217638 -2.241984 -0.312076
C  5.306354 -2.409504 -1.188035
C  -5.537184 -0.490138 0.350307
C  -7.925076 -0.952472 0.040194
C  -9.042866 -0.594929 -0.935191
H  3.244296 1.059688 1.91024
H  3.164323 2.750245 1.365133
H  1.877684 2.92265 -1.108469
H  1.823629 1.235032 -1.678795
H  -0.415304 2.60928 -1.910594
H  -2.753483 1.693286 -1.609622
H  4.970773 2.761662 -1.519434
H  6.041645 2.576631 -0.094032
H  4.564148 3.577651 0.01608
H  6.227247 0.844041 -1.646272
H  2.985016 -0.841991 0.764304
H  -4.815354 0.731609 -1.108174
H  0.008821 -0.726572 2.930892
H  -1.632069 -1.378076 3.179438
H  6.871415 -1.439849 -2.346884
H  3.661367 -3.110637 0.05295
H  -7.732128 -2.040278 0.077779
H  -8.137928 -0.607275 1.068578
H  -9.984457 -1.07972 -0.618816
H  -9.206865 0.496063 -0.964496
H  -8.800988 -0.939219 -1.955461
