program: Gaussian 09
title: 000158200
version: EM64L-G09RevD.01
frameworkgroup: C1[X(C6H10O4)]
method: RPBEPBE
basis: SDD
operation: Freq
keyword: #pfreq=noraman
keyword: PBEPBE/SDD
title: #p freq=noraman PBEPBE/SDD
converged: YES YES NO NO
title: Mulliken charges:
elementType: O O O O C C C C C C H H H H H H H H H H
charge: -0.289588 -0.263549 -0.444718 -0.439744 -0.076264 -0.051735 -0.148813 -0.360991 -0.171643 -0.316993 0.240134 0.254236 0.233635 0.218004 0.234356 0.244570 0.224598 0.217560 0.347881 0.349063
chargesum: 0.00000
title: Mulliken charges with hydrogens summed into heavy atoms:
elementType: O O O O C C C C C C
charge: -0.289588 -0.263549 -0.096837 -0.090681 0.163870 0.202500 0.084822 0.091370 0.072927 0.125165
polarizability: 8.95055241e+01 -4.14491107e+00 7.45802938e+01 1.54054878e+00 -7.37702435e-01 5.85993005e+01
1716.lowfreq: -16.6535 -6.6103 0.0004 0.0006 0.0008 3.9843 20.2296 42.1807 67.1317
frequency: 13.8515 41.5319 67.0768 109.1289 152.2612 216.4415 270.7149 288.3199 306.3496 351.6969 389.0095 473.8587 525.7611 549.4686 627.4879 749.5243 810.8080 846.5873 868.6109 917.0799 982.1243 1001.1009 1014.7323 1019.7381 1034.6162 1048.1110 1080.8899 1097.6644 1111.5067 1137.2794 1159.3849 1194.0384 1220.6303 1231.4598 1247.2746 1265.2978 1280.0454 1298.5716 1312.8081 1387.9650 1396.4041 1409.3228 1478.4723 1489.4532 2973.3325 2992.5314 3001.1368 3007.9198 3068.6945 3085.0608 3099.8250 3175.9682 3578.8573 3592.6417
redmass: 1.9822 2.2420 4.1979 3.0178 3.3769 4.4189 3.8697 1.0750 6.1572 4.1637 3.2016 4.0096 4.3273 4.3874 4.8551 8.3100 2.6242 3.4259 2.2527 2.1131 6.1781 1.6849 2.6574 2.0988 2.4710 2.3543 2.9418 1.3483 1.4236 1.1521 1.8601 1.2961 1.2160 1.5018 1.3124 1.2613 1.3638 1.4957 1.2517 1.5568 1.5496 1.7586 1.1919 1.0901 1.0839 1.0725 1.0786 1.0846 1.0523 1.1027 1.0910 1.1192 1.0666 1.0671
irintensity: 106.8514 109.2293 3.0498 37.7426 2.9275 14.3001 32.1655 29.7391 0.6824 5.1195 3.6684 8.1550 20.3440 6.9972 8.1630 10.5421 24.0123 31.6096 12.0197 0.5130 215.8344 17.1509 31.8909 5.0764 20.3445 12.1543 24.9868 5.5991 6.7876 7.7374 3.1197 10.6712 29.1219 1.9036 8.7911 2.6812 6.8629 23.5941 6.1053 2.0856 2.0586 5.5338 2.7940 6.3968 9.7048 34.5890 15.7795 59.9869 24.9247 34.5188 15.6266 25.1750 7.0385 10.8213
temp: 298.150 k
press: 1.00000 atm
elementType: 8 8 8 8 6 6 6 6 6 6 1 1 1 1 1 1 1 1 1 1
symmnumber: 1
zpe: 413013.3 jmol-1
zpe.correction: 0.157308 hartree
zpe.thermalcorrener: 0.168182 hartree
zpe.thermalcorrenthalpy: 0.169126 hartree
zpe.thermalcorrgfe: 0.118618 hartree
zpe.sumelectzpe: -534.639081 hartree
zpe.sumelectthermal: -534.628208 hartree
zpe.sumelectthermalent: -534.627264 hartree
zpe.sumelectthermalfe: -534.677771 hartree
dipole: 3.4200 4.0825 1.1026
dipole: 5.4386
quadrupole: -61.1791 -57.9947 -58.7239
quadrupole: -1.7724 -7.9831 0.8817
quadrupole: -1.8799 1.3045 0.5753 -1.7724 -7.9831 0.8817
hfenergy: -534.7963896 hartree
pointgroup: C01 [X(C6H10O4)]
dipole: -1.3844235 -1.5783875 0.4129083 debye
dipolederiv: -0.6132495 -0.1679586 0.0324863 -0.223354 -0.3967821 0.0885439 0.077201 0.0869804 -0.3866146 -0.8350439 0.2218629 0.0536408 0.2720892 -0.5197249 -0.0227286 0.0284102 -0.0326455 -0.3458675 -0.4220849 0.1357599 -0.200905 0.1235551 -0.7761185 -0.1197636 -0.1646948 -0.2120957 -0.3336835 -0.9262528 -0.0199161 0.0790359 -0.0186527 -0.3805547 0.2220441 0.2383949 0.2245122 -0.3312096 0.4405068 -0.2476312 0.0131871 -0.3723443 0.4200164 0.0442001 0.0185584 0.0178191 0.2329511 0.3416395 0.0702753 0.0330224 0.1515187 0.1192351 0.0222618 0.0194179 0.077672 0.2513006 0.0009607 -0.0742516 0.0562035 0.0602224 0.5579282 0.1076756 -0.0246982 0.1117818 0.2637204 0.1114541 0.0994707 0.0738421 -0.0114204 0.2141536 0.0029991 0.0607077 -0.0294957 0.2551513 0.6298805 0.1982742 -0.0914543 0.0809323 0.1203406 -0.0893859 -0.1195588 -0.0880857 0.2781246 0.5986946 -0.1895505 -0.0715939 -0.0738937 0.1436611 -0.0323183 -0.1248699 0.0257148 0.3169337 0.0089286 0.0380703 0.0282334 0.0649348 0.0003479 -0.0513787 0.0356578 -0.0618193 -0.0838823 -0.0056287 0.0271211 0.0327662 0.003969 0.0801005 -0.0854671 0.0144235 -0.0584895 -0.0722683 0.067058 0.0139089 -0.0028915 0.0200168 -0.0193574 -0.0116963 -0.0153838 -0.0118642 -0.1558468 0.0091356 0.0526437 -0.1024759 0.0609401 0.0022783 0.0479873 -0.1126488 0.0781221 -0.0316425 0.1316244 -0.0343627 -0.049616 -0.0012797 -0.0474879 -0.049887 -0.045281 -0.0853537 -0.0133966 -0.0172234 -0.0258376 0.0056053 -0.0215458 0.0371986 -0.0420919 -0.0147209 -0.0150804 -0.1473289 -0.0598029 0.0899341 -0.0421575 0.0918415 -0.032676 0.0621265 -0.0711398 0.1115435 0.0194452 -0.0191558 0.0206249 0.0351802 -0.0004709 0.0670622 -0.0147156 0.1045375 -0.0817564 -0.1365027 0.2362091 -0.1386328 0.131039 -0.0782343 0.2314765 0.0509587 0.1337235 0.0768856 0.2161363 0.3223501 -0.0698046 -0.013148 -0.1288242 0.1789025 -0.1293642 -0.0380365 -0.1343454 0.2044801 unknown
polarizability: 89.2666309|-4.4907769|74.7712113|-1.7455803|1.0807316|58.6472762 unknown
InChI: InChI=1S/C6H10O4/c7-3-1-10-6(5(3)8)4-2-9-4/h3-8H,1-2H2
charge 0 multiplicity 1
20 atoms
O  3.071609 0.571419 -0.18636
O  -0.065681 1.680294 -0.234921
O  -0.409545 -1.937008 -0.522904
O  -3.04091 -0.279876 0.592148
C  0.522538 0.312048 -0.320163
C  1.776144 0.247767 0.518182
C  -0.589517 -0.649955 0.150217
C  2.786528 -0.833868 0.282129
C  -1.889026 0.097658 -0.232274
C  -1.520331 1.563693 0.049598
H  0.774683 0.089855 -1.376081
H  1.692188 0.702412 1.514628
H  -0.578089 -0.765415 1.255502
H  3.407592 -1.180155 1.117224
H  2.604308 -1.561448 -0.518233
H  -2.082633 -0.071306 -1.311251
H  -2.050673 2.283686 -0.594093
H  -1.72377 1.799424 1.112812
H  -0.918372 -2.6342 -0.039215
H  -3.571643 -0.973826 0.129655
