program: Gaussian 09
title: 000158190
version: EM64L-G09RevD.01
frameworkgroup: C1[X(C7H9NOS)]
method: RPBEPBE
basis: SDD
operation: Freq
keyword: #p
keyword: freq=noraman
keyword: PBEPBE/SDD
title: #p freq=noraman PBEPBE/SDD
converged: NO YES NO NO
title: Mulliken charges:
elementType: S O N C C C C C C C H H H H H H H H H
charge: 0.406417 -0.276653 -0.503753 -0.447038 -0.502633 -0.461600 0.306549 -0.312246 0.213170 -0.594554 0.224118 0.234263 0.238616 0.244309 0.236791 0.240995 0.283872 0.234766 0.234611
chargesum: 0.00000
title: Mulliken charges with hydrogens summed into heavy atoms:
elementType: S O N C C C C C C C
charge: 0.406417 -0.276653 -0.503753 0.011343 -0.019708 0.016185 0.306549 -0.312246 0.213170 0.158695
polarizability: 1.22449292e+02 -2.76451549e-01 1.15229427e+02 -7.60213973e-01 -1.49744079e-01 5.70010198e+01
1716.lowfreq: 0.0007 0.0016 0.0023 8.7833 9.2549 12.3947 89.8389 126.0876 146.1013
frequency: 89.8303 126.0814 146.0971 149.9278 208.9734 226.6382 243.3582 295.3371 416.6992 460.1267 476.7039 506.4923 549.7653 656.0579 706.8172 751.9732 809.9314 879.2005 892.3239 898.2264 982.9108 1009.2805 1038.9095 1120.9580 1126.4101 1135.5328 1146.3866 1192.4697 1194.0739 1247.0065 1274.8984 1292.5680 1302.5579 1361.0855 1413.0688 1459.3653 1467.8870 1471.3103 1480.0688 1481.6745 1594.8790 1617.8351 2976.2635 2984.9130 2993.7858 3020.2318 3043.1886 3053.2987 3063.7220 3090.3309 3094.2248
redmass: 2.5816 1.8892 1.1210 3.4467 3.8838 4.7153 3.8281 4.2595 7.5756 5.4997 4.2696 11.0277 7.6282 2.0325 6.8644 4.3770 2.0365 2.4397 2.3808 2.3453 4.5963 2.7515 1.6872 1.2727 3.2992 1.2096 2.3918 1.2507 1.2500 1.8438 1.6170 2.1838 1.6278 3.7581 1.1741 1.0988 1.0829 1.0449 1.1048 1.0604 9.2888 8.7992 1.0323 1.0623 1.0631 1.0665 1.0965 1.0976 1.1033 1.1051 1.0990
irintensity: 4.6988 4.1399 1.0900 1.1466 0.5447 3.3986 2.8210 9.9360 4.0015 3.6385 9.1559 1.9316 1.4950 6.7252 7.0056 4.1605 6.4197 0.3637 3.4471 0.8110 21.0432 0.5814 0.0889 0.0889 7.4012 3.2178 24.3811 1.2953 5.4496 5.8747 9.9885 46.7360 1.2063 32.9058 28.4986 3.8350 10.2609 19.7895 4.1814 10.3182 122.1718 168.4314 63.4443 29.8612 28.4392 34.5268 22.1111 16.8867 32.7631 43.0469 2.3553
temp: 298.150 k
press: 1.00000 atm
elementType: 16 8 7 6 6 6 6 6 6 6 1 1 1 1 1 1 1 1 1
symmnumber: 1
zpe: 390112.1 jmol-1
zpe.correction: 0.148586 hartree
zpe.thermalcorrener: 0.158247 hartree
zpe.thermalcorrenthalpy: 0.159191 hartree
zpe.thermalcorrgfe: 0.113528 hartree
zpe.sumelectzpe: -799.410932 hartree
zpe.sumelectthermal: -799.401270 hartree
zpe.sumelectthermalent: -799.400326 hartree
zpe.sumelectthermalfe: -799.445989 hartree
dipole: 1.9258 -3.4148 -0.0426
dipole: 3.9206
quadrupole: -54.8527 -73.6892 -66.5504
quadrupole: 4.8549 -0.3834 0.0938
quadrupole: 10.1781 -8.6584 -1.5197 4.8549 -0.3834 0.0938
hfenergy: -799.5595175 hartree
pointgroup: C01 [X(C7H9N1O1S1)]
dipole: 0.8427043 -1.2918736 -0.014856 debye
dipolederiv: -0.2050236 -0.2062853 0.0082479 -0.1208265 -0.367523 0.0039799 0.0033422 -0.0063946 0.1790716 -0.5785465 0.3349829 -0.0007304 0.2157019 -1.1804502 0.005934 0.0012232 0.001834 -0.3617795 -0.5847446 -0.4955334 0.0048244 -0.2617182 -0.225594 0.0056506 0.0036649 0.0021489 -0.3510784 0.0788512 0.0295159 -0.0347754 0.0515941 0.0043692 0.0006158 0.0421813 0.0120749 0.1419733 0.0360996 0.029263 -0.0126649 0.0121036 0.0449877 0.006814 -0.012026 0.010506 0.193771 0.0057441 -0.0590173 -0.0052718 -0.1117214 -0.0166501 -0.027296 0.019842 -0.0391467 0.2066712 -0.3731923 0.4239646 -0.000403 0.2938375 -0.3250187 -0.0054754 -0.0166537 -0.0441226 -0.0595454 0.3848492 0.2196191 -0.006214 0.1103214 0.5405404 0.0029971 -0.0439079 0.0479684 -0.1797005 0.711885 -0.2834615 -0.0046009 -0.1713775 1.3760827 -0.00951 -0.0044863 -0.0000662 0.2197608 0.5181677 0.1246189 -0.0062387 0.1566695 -0.0163057 -0.0011557 -0.0036258 0.0005418 0.2709627 -0.1444897 -0.040087 0.0912347 -0.052686 0.0596882 0.0146257 0.1228525 0.0181325 0.024067 0.0447455 -0.0049293 -0.0505452 -0.0061266 0.0468752 -0.0064725 -0.1199293 -0.0183681 -0.1317409 0.0115201 -0.0450784 0.0128815 -0.0259886 0.0112698 0.0775984 0.0407561 0.1220074 -0.0870836 0.0428024 -0.0120507 -0.0002829 -0.0345901 -0.0513213 -0.0897915 -0.0280063 -0.1160674 0.0064311 0.0220323 0.0420698 -0.030336 0.0504651 -0.0431094 0.0880039 -0.0779554 0.1181932 0.006412 -0.0048139 0.0352808 0.0353871 0.0027668 0.0274153 -0.0681362 0.0718232 -0.1101899 -0.0828741 0.0912513 -0.0110605 0.0012283 0.1124302 0.0068953 -0.0010113 0.0000513 0.0012149 0.1428737 -0.0263898 -0.0385054 0.0275289 -0.1073131 0.0555339 0.1048247 0.1025756 0.092316 -0.0737105 -0.0307482 -0.0433063 -0.0292697 -0.113542 0.0523147 -0.1021957 -0.1017216 -0.0925827 -0.0644814 unknown
polarizability: 122.4576792|0.1905768|115.223809|-0.613596|-0.2051988|56.9982507 unknown
InChI: InChI=1S/C7H9NOS/c1-8-7(9)5-3-2-4-6(5)10-8/h2-4H2,1H3
charge 0 multiplicity 1
19 atoms
S  -0.7062 -1.939944 0.006245
O  -1.538534 1.929274 -0.005984
N  -1.709735 -0.423061 0.012706
C  2.847878 0.230424 0.196792
C  1.715755 1.290242 -0.07052
C  2.226157 -1.192487 -0.075305
C  0.458579 0.45261 -0.014862
C  0.751635 -0.88258 -0.011348
C  -0.968351 0.792466 -0.005554
C  -3.17035 -0.490656 0.049184
H  3.740201 0.409056 -0.426642
H  3.16003 0.288903 1.254358
H  1.824615 1.770118 -1.062278
H  1.717959 2.100884 0.679306
H  2.553667 -1.940688 0.669228
H  2.504849 -1.581449 -1.074617
H  -3.518752 0.556689 0.048072
H  -3.533634 -0.990739 0.965498
H  -3.577371 -1.006764 -0.839381
