program: Gaussian 09
title: 000013917
version: EM64L-G09RevD.01
frameworkgroup: C1[X(C13H19NO2)]
method: RPBEPBE
basis: SDD
operation: Freq
keyword: #p
keyword: freq=noraman
keyword: PBEPBE/SDD
title: #p freq=noraman PBEPBE/SDD
converged: YES YES NO NO
title: Mulliken charges:
elementType: O O N C C C C C C C C C C C C C H H H H H H H H H H H H H H H H H H H
charge: -0.336283 -0.280581 -0.376370 -0.221604 0.446718 -0.371328 -0.721295 0.263339 -0.511001 -0.699093 -0.390528 0.334473 -0.854909 -0.435598 0.295015 -0.607750 0.215814 0.212497 0.195389 0.224830 0.209481 0.221575 0.302425 0.214456 0.232935 0.198629 0.230325 0.228123 0.231817 0.236360 0.249833 0.330284 0.229774 0.230057 0.272192
chargesum: 0.00000
title: Mulliken charges with hydrogens summed into heavy atoms:
elementType: O O N C C C C C C C C C C C C C
charge: -0.336283 -0.280581 -0.046086 -0.005790 0.446718 0.036557 -0.065409 0.263339 -0.208576 -0.053073 -0.160203 0.334473 -0.158609 -0.185764 0.295015 0.124272
polarizability: 2.10092681e+02 -2.75957526e+00 1.61170772e+02 4.11439996e+00 6.97778958e+00 1.02897350e+02
1716.lowfreq: -17.6742 -4.0931 -0.0006 -0.0006 -0.0005 3.3521 18.9783 24.8899 42.3307
frequency: 17.6965 24.7309 42.3166 73.2190 89.4413 101.7623 123.9120 132.2777 166.7876 172.1759 179.5191 200.7310 207.7211 229.8698 276.4174 278.3616 303.4820 338.1422 346.5391 369.3706 421.9397 473.8392 483.1897 523.9855 577.4829 580.5383 615.6690 661.8280 685.3051 718.6502 739.4505 747.7676 795.7896 819.6086 833.0938 874.6424 922.1449 926.3914 947.7237 962.9425 989.2245 1002.4210 1026.0997 1042.2316 1075.4420 1084.2664 1097.9017 1109.0564 1126.1971 1144.0731 1155.9932 1163.2738 1181.1404 1200.9626 1246.4155 1252.0362 1279.8059 1293.2723 1333.6163 1335.2792 1378.4990 1386.5912 1389.5085 1397.7147 1410.3711 1429.9595 1457.4330 1464.8013 1471.2862 1472.9748 1476.3507 1477.7510 1481.2115 1484.4422 1484.7970 1488.8708 1513.4689 1589.9723 1610.4964 1682.9164 2972.2554 2972.6743 2973.2659 2976.2999 2980.0368 3001.8252 3028.2744 3048.9495 3057.5855 3066.0825 3069.9649 3076.6036 3077.3278 3078.3090 3113.8737 3126.7676 3167.1996 3188.6352 3579.3794
redmass: 4.1795 3.9347 4.0761 3.3086 3.5467 1.1091 2.1927 2.4396 2.8213 1.3906 1.9262 2.4125 1.0593 1.4861 2.9721 4.8020 3.9142 3.9520 4.3136 3.3488 3.0218 2.8205 3.4811 3.3499 4.4542 1.1383 3.7459 6.4673 12.0572 4.1145 2.9657 3.6690 1.4070 1.3612 2.1673 3.5694 1.8859 2.1117 1.3387 1.2527 1.4641 1.6983 2.6280 1.5682 2.6856 1.8853 2.8117 2.1873 1.2826 1.7027 1.5551 2.4259 2.2068 2.1015 2.2936 1.6137 1.4211 1.2534 1.4128 1.7713 2.7348 1.3114 1.2505 1.3155 2.7236 1.1672 1.3661 1.0629 1.0627 1.0513 1.0594 1.1478 1.0792 1.0442 1.0735 2.0982 1.4028 7.2003 6.4368 9.1207 1.0448 1.0374 1.0368 1.0495 1.0355 1.0847 1.0988 1.0975 1.1027 1.0995 1.0995 1.0992 1.0999 1.0986 1.0980 1.0890 1.0955 1.0915 1.0773
irintensity: 1.8156 3.1020 4.5681 0.1651 2.0290 0.1269 0.2105 0.2463 1.5568 0.6882 0.5476 0.3906 0.1011 0.2630 0.9496 4.7718 0.7001 8.1173 14.3959 3.1200 0.5022 6.1861 2.2497 0.4515 1.3095 131.5093 8.0460 4.0875 24.8167 1.0550 4.4654 7.2475 9.0411 37.7583 1.7847 13.4278 33.9050 38.0145 0.6897 2.3685 18.6609 12.5632 1.9848 8.0037 57.4468 5.2355 53.0947 110.5451 0.0984 151.7907 14.2047 287.1589 71.6113 171.5673 45.3899 5.0829 45.5968 15.4728 2.1044 1.8975 13.6410 6.8258 30.3559 2.9800 8.6323 30.5467 239.6867 1.7763 9.7157 10.1495 5.3377 36.9371 12.5689 13.5963 19.1438 125.6742 141.7897 7.5051 31.7157 252.0280 13.3029 32.0980 52.7339 45.9246 88.1810 10.8602 22.8346 21.7851 37.1245 33.6968 50.7958 42.3870 69.9967 28.2083 3.7599 21.0761 9.8110 3.7244 44.6868
temp: 298.150 k
press: 1.00000 atm
elementType: 8 8 7 6 6 6 6 6 6 6 6 6 6 6 6 6 1 1 1 1 1 1 1 1 1 1 1 1 1 1 1 1 1 1 1
symmnumber: 1
zpe: 772966.4 jmol-1
zpe.correction: 0.294407 hartree
zpe.thermalcorrener: 0.312383 hartree
zpe.thermalcorrenthalpy: 0.313327 hartree
zpe.thermalcorrgfe: 0.246767 hartree
zpe.sumelectzpe: -710.777619 hartree
zpe.sumelectthermal: -710.759643 hartree
zpe.sumelectthermalent: -710.758699 hartree
zpe.sumelectthermalfe: -710.825259 hartree
dipole: 1.4273 1.4218 0.2317
dipole: 2.0279
quadrupole: -70.1425 -94.6873 -100.0820
quadrupole: 3.5528 2.2624 0.6387
quadrupole: 18.1614 -6.3834 -11.7781 3.5528 2.2624 0.6387
hfenergy: -711.072026 hartree
pointgroup: C01[X(C13H19N1O2)]
dipole: 0.6109723 0.5065668 0.0816574 debye
polarizability: 209.3084022|-5.6428642|160.2474842|-5.3060101|12.2032741|104.6049163 unknown
InChI: InChI=1S/C13H19NO2/c1-5-9(2)12-8-11(7-6-10(12)3)16-13(15)14-4/h6-9,14H,5H2,1-4H3
charge 0 multiplicity 1
35 atoms
O  2.219312 0.715748 0.003747
O  2.342092 -1.623785 -0.482191
N  4.233596 -0.251776 -0.248483
C  -2.524352 -1.001162 -0.361281
C  -1.535394 0.141438 -0.09049
C  -2.375676 -2.161902 0.668253
C  -2.378428 -1.534776 -1.812383
C  -1.969251 1.464376 0.222537
C  -0.147027 -0.146332 -0.168747
C  -2.684418 -1.742956 2.121351
C  -0.986091 2.464026 0.447799
C  0.800587 0.871305 0.060336
C  -3.441367 1.836528 0.324184
C  0.391564 2.18525 0.370998
C  2.882147 -0.51076 -0.266958
C  5.228472 -1.298944 -0.488348
H  -3.553414 -0.607886 -0.254043
H  -1.347946 -2.571625 0.609088
H  -3.057508 -2.982301 0.365213
H  -1.382215 -1.98662 -1.972005
H  -3.139398 -2.310568 -2.019157
H  -2.500799 -0.722985 -2.552244
H  0.19654 -1.154214 -0.40626
H  -2.572838 -2.596486 2.814976
H  -2.001173 -0.941726 2.457057
H  -3.721429 -1.366486 2.214924
H  -1.308059 3.483986 0.689251
H  -3.555615 2.908534 0.560765
H  -3.984722 1.64491 -0.620403
H  -3.95803 1.263395 1.117124
H  1.145426 2.958811 0.544183
H  4.522799 0.707719 -0.05837
H  5.897244 -1.423967 0.383222
H  5.840871 -1.074558 -1.381313
H  4.6908 -2.245011 -0.658731
