program: Gaussian 09
title: 000158845
version: EM64L-G09RevD.01
frameworkgroup: C1[X(C22H26O11)]
method: RPBEPBE
basis: SDD
operation: Freq
keyword: #p
keyword: freq=noraman
keyword: PBEPBE/SDD
title: #p freq=noraman PBEPBE/SDD
converged: YES YES NO NO
title: Mulliken charges:
elementType: O O O O O O O O O O O C C C C C C C C C C C C C C C C C C C C C C H H H H H H H H H H H H H H H H H H H H H H H H H H
charge: -0.270270 -0.280791 -0.471195 -0.468236 -0.482090 -0.449259 -0.227328 -0.437898 -0.285229 -0.273799 -0.267269 -0.153002 -0.100945 -0.180188 0.024216 -0.029738 -0.401128 0.171772 0.435409 -0.294940 -0.463394 -0.585603 -0.368239 0.299090 0.262075 0.054458 0.251261 0.245946 -0.374344 -0.383075 -0.207568 -0.550883 -0.532279 0.219800 0.211643 0.263652 0.231147 0.222551 0.193016 0.239882 0.370454 0.367913 0.384102 0.347591 0.309686 0.224907 0.249144 0.229745 0.255129 0.352413 0.244968 0.243493 0.224043 0.216122 0.226565 0.273277 0.246679 0.223923 0.222617
chargesum: 0.00000
title: Mulliken charges with hydrogens summed into heavy atoms:
elementType: O O O O O O O O O O O C C C C C C C C C C C C C C C C C C C C C C
charge: -0.270270 -0.280791 -0.100741 -0.100323 -0.097989 -0.101668 -0.227328 -0.085485 -0.285229 -0.273799 -0.267269 0.066798 0.110697 0.083464 0.255364 0.192814 0.031770 0.171772 0.435409 0.014746 0.010657 -0.355858 -0.113110 0.299090 0.262075 0.054458 0.251261 0.245946 -0.129376 -0.139582 0.016475 0.165081 0.160940
polarizability: 3.28876078e+02 3.05200062e+00 3.02863512e+02 -2.88490551e+01 -9.15267430e+00 2.21011369e+02
1716.lowfreq: -12.2250 -5.3379 -0.0008 -0.0007 0.0003 2.9248 14.4157 23.2652 26.0797
frequency: 14.3612 23.2148 26.0678 32.5503 44.1662 57.1579 64.5583 71.7590 76.8504 86.4257 97.5312 100.2241 121.7705 122.4193 138.4267 153.9040 158.5375 164.0376 173.8496 186.6648 190.4600 203.5100 210.0432 221.0398 233.1314 235.9755 244.5290 264.6059 267.1874 277.9198 288.9337 296.8768 319.0659 322.9570 325.7575 346.4658 356.4287 369.3926 379.6406 398.3658 413.0870 428.6556 434.9855 453.9945 462.0767 474.6222 482.3199 488.4140 493.2041 551.1029 552.0945 559.9802 566.1234 581.1040 594.1364 596.3826 604.8143 607.5827 638.1276 701.7199 705.3799 714.7371 721.4387 725.0700 740.6728 774.8669 780.4362 798.5670 836.4395 839.4370 844.6017 853.5554 857.8792 867.4289 926.0587 937.1928 951.6153 954.5303 967.6911 973.1250 982.7325 984.3567 996.1177 1012.5356 1027.8845 1040.1319 1049.2103 1060.3282 1066.2286 1079.4095 1087.8765 1090.2220 1096.4502 1107.7935 1111.9839 1113.9329 1120.6890 1135.1816 1152.2189 1165.9241 1171.8731 1181.1147 1191.1574 1199.1942 1213.4050 1217.2054 1220.1447 1234.2913 1234.9891 1237.5238 1245.1440 1261.0457 1263.6735 1270.8551 1288.1091 1301.1148 1308.2075 1313.5155 1343.7311 1345.1290 1348.2651 1365.4579 1387.9023 1388.1424 1389.5586 1393.7135 1422.9409 1423.2682 1424.4965 1433.7428 1436.7687 1458.7138 1461.5846 1463.8135 1465.3791 1467.5487 1470.1811 1477.3317 1480.3190 1497.7352 1589.6202 1603.3154 1606.2589 1618.1489 1623.6583 2930.7570 2947.1246 2956.4799 2961.3086 2962.0806 2964.3179 2981.5523 3012.1059 3029.2360 3029.4836 3054.3896 3055.6071 3101.3870 3109.3187 3118.0477 3128.9582 3139.2240 3155.7844 3170.9513 3176.7022 3180.5567 3317.3567 3531.2440 3540.2014 3579.2050 3585.6838
redmass: 4.7743 5.8410 5.6591 6.4997 6.7966 5.3252 3.6036 4.7138 5.3108 6.3017 5.5945 3.7662 7.3699 5.3449 5.8914 6.7490 4.8329 5.0098 4.3750 2.0134 1.6130 4.5830 3.7611 2.1723 2.2618 1.4656 6.0451 1.8671 5.6746 3.5085 3.9372 4.7380 3.7024 1.1362 5.3166 4.1613 5.6527 6.5005 4.8315 6.0944 5.2360 3.2464 1.7804 1.8836 3.2083 1.2910 4.9408 5.1214 5.0103 4.4167 4.4521 4.1385 4.4137 3.9238 3.4188 4.8443 5.1585 5.2180 4.7677 6.4753 4.0592 3.9776 1.4132 1.9195 2.8639 4.7819 3.3650 5.4170 1.8876 1.4353 1.5727 3.0620 6.6157 3.7119 7.2401 3.4241 1.3039 5.7596 1.3374 5.9301 6.2186 8.8334 2.2432 3.7623 2.7994 5.4272 3.9228 2.9990 2.9390 5.6064 3.0926 1.9115 3.2561 1.8310 1.2577 1.2533 1.8373 1.6172 1.3484 1.3480 1.2774 1.5203 1.1679 1.9739 1.0949 1.2975 2.0209 1.8336 1.2749 1.7065 1.2808 1.5955 4.4349 1.4665 1.2331 1.3807 1.5021 1.2282 1.3024 1.2663 1.3996 1.3353 5.1663 1.8854 1.5781 4.9765 1.3981 1.4956 1.4535 3.2091 1.2565 1.8256 1.1969 1.4362 1.0857 1.0502 1.0719 1.0586 1.6272 2.8498 7.6311 7.5989 7.5304 8.8408 7.2419 1.0835 1.0812 1.0608 1.0406 1.0729 1.0327 1.0827 1.0846 1.1026 1.0580 1.1043 1.1041 1.1074 1.0919 1.1017 1.0996 1.0875 1.0902 1.0914 1.0965 1.0969 1.0682 1.0650 1.0656 1.0666 1.0661
irintensity: 0.2051 0.0172 0.4365 1.3051 1.6644 1.4427 3.0917 4.2997 3.8920 0.5691 4.2013 1.0646 3.4180 1.7615 4.8055 6.4577 7.7604 3.0822 16.7986 62.8480 4.1868 14.4992 29.1205 52.1053 2.7433 0.4256 14.9508 1.3962 7.2404 6.3164 3.9504 4.9169 0.8375 139.5749 3.7761 1.9760 2.6148 0.9730 3.2528 1.5117 2.3002 13.9982 84.2033 55.2680 7.9389 191.9437 6.0300 14.5961 8.1107 10.1903 6.8400 27.1196 4.1328 47.2065 5.7421 5.3666 15.0019 22.1573 6.9008 8.4135 15.6484 12.8441 131.5881 28.2651 32.3505 5.3765 33.1356 21.9577 18.4146 0.0412 72.3060 14.5865 0.0435 12.4165 216.7896 31.7348 0.5336 58.7209 1.5510 127.0694 31.2903 20.3201 36.9074 103.6349 88.9673 227.5388 8.3997 27.8507 116.9093 258.9113 67.3521 63.9559 29.0671 47.1808 0.2631 0.5929 11.0259 185.1958 2.8092 9.3098 18.8265 76.3476 5.8777 89.4879 17.3973 5.6286 115.6754 176.1647 9.7810 232.1652 9.5477 8.4279 29.7488 11.6454 21.6666 19.9971 7.7154 17.9217 64.1114 15.7186 22.0394 2.0992 20.8023 12.4266 28.5572 69.9087 41.9982 23.5561 38.5972 88.3516 10.0626 138.8572 19.8457 2.9701 7.5750 12.9992 26.6744 11.8945 2.2974 134.4795 82.1755 142.3794 1.5926 231.3805 54.1248 27.0398 23.3932 20.0740 42.7363 34.1879 71.5886 96.7419 29.4927 41.1874 31.6806 39.8353 36.9531 7.7118 19.4740 3.2276 19.7937 9.6385 3.1456 10.7942 5.6165 11.4444 540.9259 23.1218 21.2356 4.3033 41.4273
temp: 298.150 k
press: 1.00000 atm
elementType: 8 8 8 8 8 8 8 8 8 8 8 6 6 6 6 6 6 6 6 6 6 6 6 6 6 6 6 6 6 6 6 6 6 1 1 1 1 1 1 1 1 1 1 1 1 1 1 1 1 1 1 1 1 1 1 1 1 1 1
symmnumber: 1
zpe: 1196634.0 jmol-1
zpe.correction: 0.455774 hartree
zpe.thermalcorrener: 0.488927 hartree
zpe.thermalcorrenthalpy: 0.489871 hartree
zpe.thermalcorrgfe: 0.390171 hartree
zpe.sumelectzpe: -1678.843139 hartree
zpe.sumelectthermal: -1678.809986 hartree
zpe.sumelectthermalent: -1678.809042 hartree
zpe.sumelectthermalfe: -1678.908742 hartree
dipole: 4.7357 0.2301 2.7683
dipole: 5.4903
quadrupole: -160.3701 -183.9500 -182.5022
quadrupole: 6.2940 -10.0920 -18.0448
quadrupole: 15.2373 -8.3426 -6.8948 6.2940 -10.0920 -18.0448
hfenergy: -1679.2989129 hartree
pointgroup: C01 [X(C22H26O11)]
dipole: 1.9651729 0.7911005 0.4220169 debye
polarizability: 291.8980191|6.4468931|311.7380828|-51.7015714|-18.8412782|249.1148575 unknown
InChI: InChI=1S/C22H26O11/c1-29-14-4-3-5-15(30-2)17(14)21(28)31-10-11-8-12(24)6-7-13(11)32-22-20(27)19(26)18(25)16(9-23)33-22/h3-8,16,18-20,22-27H,9-10H2,1-2H3
charge 0 multiplicity 1
59 atoms
O  -2.017671 -1.422965 1.378197
O  -1.124745 0.323576 0.048507
O  -1.583591 -4.177957 -1.739143
O  -3.273596 -4.824398 0.498246
O  -1.294479 -1.39711 -2.321146
O  -3.947387 -2.02865 3.516027
O  1.171723 2.046435 -0.819905
O  -2.795029 5.274926 2.136378
O  0.913746 0.222463 -2.253819
O  1.754854 -0.994805 0.623683
O  3.930835 1.897342 -2.434832
C  -2.190517 -3.122082 -0.925597
C  -2.352822 -3.685093 0.492981
C  -1.333521 -1.84819 -0.938311
C  -2.93843 -2.587742 1.408844
C  -1.975172 -0.827615 0.022446
C  -3.086714 -3.023881 2.85684
C  -1.611974 1.537991 0.583236
C  -1.078728 2.709927 -0.014157
C  -2.513776 1.611167 1.668721
C  -0.173653 2.604657 -1.215948
C  -1.460653 3.968411 0.505106
C  -2.9023 2.873664 2.1604
C  -2.372563 4.049582 1.583536
C  1.57649 0.858638 -1.398372
C  2.916967 0.432618 -0.866113
C  2.99126 -0.525913 0.175922
C  4.113191 0.965784 -1.4045
C  4.245359 -0.941006 0.689606
C  5.37586 0.554414 -0.907818
C  5.421244 -0.392389 0.137368
C  1.704128 -1.791403 1.854643
C  5.126796 2.491375 -3.037268
H  -3.195988 -2.869661 -1.332289
H  -1.351182 -3.994553 0.864192
H  -0.312623 -2.057038 -0.558891
H  -3.938545 -2.288887 1.026614
H  -3.010074 -0.547171 -0.282752
H  -2.084347 -3.067923 3.333359
H  -3.548701 -4.031066 2.867272
H  -1.328483 -3.754913 -2.601219
H  -3.011167 -5.408484 -0.260633
H  -0.512797 -0.775941 -2.42735
H  -4.090538 -2.293009 4.458692
H  -2.880295 0.692207 2.136572
H  0.050547 3.597015 -1.639598
H  -0.594159 1.940206 -1.99052
H  -1.048029 4.882303 0.056405
H  -3.599826 2.961324 2.998217
H  -2.365865 6.03677 1.674288
H  4.30585 -1.67543 1.496723
H  6.303934 0.959345 -1.3185
H  6.394245 -0.711329 0.526913
H  2.167899 -2.786174 1.707264
H  2.203363 -1.26256 2.688529
H  0.62937 -1.896255 2.067009
H  4.746501 3.181767 -3.804014
H  5.761861 1.719178 -3.512433
H  5.717014 3.05271 -2.287606
