program: Gaussian 09
title: 000158188
version: EM64L-G09RevD.01
frameworkgroup: C1[X(C16H14N2S2)]
method: RPBEPBE
basis: SDD
operation: Freq
keyword: #p
keyword: freq=noraman
keyword: PBEPBE/SDD
title: #p freq=noraman PBEPBE/SDD
converged: YES YES NO NO
title: Mulliken charges:
elementType: S S N N C C C C C C C C C C C C C C C C H H H H H H H H H H H H H H
charge: 0.051077 -0.033623 0.068600 0.102149 0.525621 0.445322 0.404054 -0.534815 -0.359037 -0.326924 -0.369542 -0.370210 -0.394595 -0.404413 -0.377223 -0.802672 -0.285455 -0.226157 -0.231666 -0.241537 0.243989 0.242978 0.281403 0.231315 0.239033 0.237924 0.280755 0.224993 0.229830 0.231508 0.243218 0.223968 0.223925 0.226209
chargesum: 0.00000
title: Mulliken charges with hydrogens summed into heavy atoms:
elementType: S S N N C C C C C C C C C C C C C C C C
charge: 0.051077 -0.033623 0.068600 0.102149 0.525621 0.445322 0.404054 -0.047848 -0.077634 -0.095609 -0.369542 -0.131177 -0.156671 -0.123658 -0.152230 -0.098117 -0.285455 -0.002189 -0.007741 -0.015329
polarizability: 4.21651058e+02 1.57277530e+01 2.46281353e+02 1.14131066e+00 3.44443311e-01 8.80945898e+01
1716.lowfreq: -7.2206 0.0021 0.0026 0.0030 1.4472 3.9808 7.9047 14.3292 21.2730
frequency: 2.4863 13.7928 21.2661 28.7134 37.2322 59.0993 87.8434 106.8929 132.1241 153.6485 194.4481 222.4930 244.8754 253.8300 286.9482 314.6352 336.0263 379.5085 398.3711 404.0602 437.7905 459.1915 459.9319 468.5167 531.4400 563.4066 565.8489 613.7377 619.0862 619.8741 625.8663 650.5318 703.2607 720.6905 735.7569 780.3523 802.5734 828.9707 856.3707 858.1787 882.8751 900.8559 943.4321 961.4352 970.5819 982.5407 989.6527 990.0201 996.6029 1004.7123 1010.6539 1026.1429 1046.5365 1077.4720 1095.4900 1133.9799 1170.3986 1182.0928 1196.2114 1210.0871 1220.4394 1228.2279 1264.8020 1300.7688 1313.3011 1341.1345 1370.2996 1387.6126 1397.9274 1415.3210 1428.3565 1439.9162 1467.4838 1473.0447 1484.6304 1503.1491 1568.0411 1587.4535 1596.3051 1617.7920 1620.1121 1678.4940 2898.7378 2938.9015 2977.7341 3059.9585 3091.4506 3108.4566 3117.0382 3125.3428 3132.3128 3138.9944 3144.3447 3156.7840 3168.9530 3169.5300
redmass: 1.0378 4.1501 4.1677 4.9400 5.6603 4.8128 9.4473 5.5907 4.7136 7.9502 2.7553 5.9450 4.1449 7.5309 9.3623 5.0428 4.4141 4.1864 2.8239 2.8523 20.5842 2.8649 8.6142 3.4081 8.8639 5.8304 6.1042 6.8892 7.5221 7.4369 6.9246 8.3626 2.4589 2.8807 1.3079 5.0687 4.4958 1.4610 1.2892 1.2518 7.3575 1.3764 8.8192 1.3591 1.7874 1.3630 2.4276 2.2186 1.3612 1.3549 2.8731 2.1970 1.5908 1.7222 3.8964 1.3603 1.0554 1.1125 1.1440 2.2492 1.0740 2.8929 4.0830 1.5751 1.2866 1.4751 4.5274 6.6113 1.2192 3.6910 1.1168 2.0791 1.1024 1.0594 2.3565 2.6599 6.4273 9.5989 6.3646 6.0993 6.4261 10.8797 1.0568 1.0992 1.0393 1.0940 1.1001 1.0878 1.0881 1.0865 1.0899 1.0928 1.0960 1.0969 1.0979 1.0955
irintensity: 0.6617 0.0200 0.1114 0.0230 0.4309 1.6046 0.8609 0.3114 0.6649 4.7747 5.7302 0.0780 3.8117 4.7335 6.3953 0.1063 6.3922 13.0995 0.2310 0.0464 7.8425 18.2095 1.5752 7.9165 30.7183 2.2251 0.3387 2.5390 8.3859 1.0653 24.2209 4.0558 23.0029 3.0599 86.4646 15.7175 8.3108 38.6632 14.9438 0.8002 42.4148 0.0787 149.0353 1.3758 4.9506 0.3937 0.7437 3.3029 2.1866 2.5713 3.0428 21.0391 27.6697 1.8054 77.9299 7.6466 1.3805 8.4230 44.6009 4.9738 1.4611 0.4347 45.4727 93.0064 6.1759 79.2493 2.2450 20.3522 13.9885 9.1372 70.4453 11.3529 17.0536 14.0449 27.0802 21.9526 117.3740 363.5278 5.1481 15.6745 54.4907 375.1896 6.0418 17.2145 26.0569 20.9331 14.7801 10.8197 19.4570 0.5254 16.2463 31.8586 13.3234 37.4096 13.1835 4.1251
temp: 298.150 k
press: 1.00000 atm
elementType: 16 16 7 7 6 6 6 6 6 6 6 6 6 6 6 6 6 6 6 6 1 1 1 1 1 1 1 1 1 1 1 1 1 1
symmnumber: 1
zpe: 671611.0 jmol-1
zpe.correction: 0.255803 hartree
zpe.thermalcorrener: 0.274803 hartree
zpe.thermalcorrenthalpy: 0.275747 hartree
zpe.thermalcorrgfe: 0.201361 hartree
zpe.sumelectzpe: -1522.319877 hartree
zpe.sumelectthermal: -1522.300877 hartree
zpe.sumelectthermalent: -1522.299933 hartree
zpe.sumelectthermalfe: -1522.374319 hartree
dipole: -3.7963 -0.8001 0.0855
dipole: 3.8806
quadrupole: -95.1155 -124.1666 -139.1800
quadrupole: 8.9650 -0.0995 0.0277
quadrupole: 24.3718 -4.6792 -19.6926 8.9650 -0.0995 0.0277
hfenergy: -1522.5756797 hartree
pointgroup: C01 [X(C16H14N2S2)]
dipole: -1.4938557 -0.2794837 0.1459225 debye
polarizability: 421.7068405|13.4857763|231.6413423|-7.8713777|-45.7022062|102.6788183 unknown
InChI: InChI=1S/C16H14N2S2/c1-12-7-9-14(10-8-12)15-18-16(20-19-15)17-11-13-5-3-2-4-6-13/h2-10H,11H2,1H3
charge 0 multiplicity 1
34 atoms
S  -1.822314 2.684822 -0.943443
S  0.426265 2.742616 -0.990603
N  1.67637 0.259506 -0.194437
N  -0.706246 0.266347 -0.17683
C  -3.147871 0.275918 -0.151621
C  -5.668257 -1.001301 0.305006
C  4.160233 0.108418 -0.182923
C  2.932505 0.979681 -0.432231
C  -3.205454 -1.061688 0.334134
C  -4.364849 0.96248 -0.409636
C  -1.833326 0.899035 -0.370276
C  -4.446415 -1.683664 0.555143
C  -5.601924 0.33015 -0.185277
C  4.038762 -1.25834 0.159217
C  5.451931 0.679173 -0.304712
C  -7.003027 -1.667486 0.575999
C  0.537407 0.824136 -0.367779
C  5.194436 -2.044233 0.375447
C  6.606412 -0.104727 -0.088863
C  6.481183 -1.472269 0.252462
H  2.977825 1.881835 0.220419
H  2.955708 1.3600 -1.480179
H  -2.265448 -1.587418 0.526634
H  -4.351732 1.990341 -0.793268
H  -4.473325 -2.71479 0.926684
H  -6.530781 0.873325 -0.394037
H  3.036129 -1.685387 0.254638
H  5.558455 1.739842 -0.568491
H  -7.802525 -1.251351 -0.060932
H  -6.95501 -2.756799 0.403228
H  -7.309786 -1.516883 1.6296
H  5.088981 -3.102511 0.640689
H  7.599413 0.348878 -0.185451
H  7.375876 -2.082257 0.420887
