program: Gaussian 09
title: 000158270
version: EM64L-G09RevD.01
frameworkgroup: C1[X(C21H34O2)]
method: RPBEPBE
basis: SDD
operation: Freq
keyword: #pfreq=noraman
keyword: PBEPBE/SDD
title: #p freq=noraman PBEPBE/SDD
converged: YES YES NO NO
title: Mulliken charges:
elementType: O O C C C C C C C C C C C C C C C C C C C C C H H H H H H H H H H H H H H H H H H H H H H H H H H H H H H H H H H
charge: -0.265866 -0.252955 -0.370169 -0.361651 -0.363163 -0.398521 -0.353517 -0.026336 -0.589055 -0.354414 -0.295190 -0.355420 0.491125 0.509187 -0.403512 -0.406877 -0.463723 -0.400011 0.253591 -0.704413 -0.700201 -0.703643 -0.697026 0.186103 0.189197 0.189010 0.224555 0.188981 0.187979 0.196731 0.214746 0.187283 0.185973 0.199221 0.208537 0.206901 0.240579 0.222130 0.232972 0.193785 0.197038 0.231757 0.231138 0.231335 0.254082 0.211073 0.231948 0.204730 0.228663 0.203324 0.211360 0.220298 0.227025 0.239358 0.209455 0.209816 0.214676
chargesum: 0.00000
title: Mulliken charges with hydrogens summed into heavy atoms:
elementType: O O C C C C C C C C C C C C C C C C C C C C C
charge: -0.265866 -0.252955 0.005131 0.051914 0.013798 0.012956 0.019738 0.172885 -0.173617 -0.113835 0.159913 0.035403 0.491125 0.509187 -0.171754 -0.175739 -0.232388 -0.145929 0.253591 -0.056663 -0.056854 -0.016962 -0.063078
polarizability: 2.60376411e+02 -2.72090469e+01 2.38555991e+02 7.11871158e+00 5.29856213e+00 1.96344744e+02
1716.lowfreq: -0.0005 0.0003 0.0007 1.8964 4.0088 7.6085 15.1599 20.2997 24.6039
frequency: 13.7724 20.2590 24.2681 30.8550 38.8628 48.7465 54.2651 59.3908 67.1450 87.7027 92.8738 105.8562 122.0414 138.6224 144.4327 156.4937 172.6251 202.9080 205.2458 221.7671 227.6503 233.0675 234.4088 250.5794 261.3971 282.6140 307.1163 331.8355 335.6120 363.4970 380.2797 392.4666 407.0315 416.0092 452.5115 459.9419 498.0093 544.9857 581.1769 630.3560 661.2349 700.4477 720.8426 724.2902 728.3148 749.6220 774.0610 781.1438 795.3694 820.7154 834.2457 849.1513 855.1159 866.4131 878.2004 880.9048 891.0124 921.2824 924.8562 950.8344 961.3637 964.3552 975.5554 985.2788 999.5752 1004.2629 1014.9445 1028.5259 1049.8575 1065.5992 1067.4957 1070.4565 1081.3422 1084.6373 1087.1398 1088.5567 1116.8610 1125.0937 1134.7749 1150.6694 1180.2184 1191.0630 1193.0673 1202.8155 1206.7517 1220.4669 1223.4318 1230.7404 1241.7907 1266.1031 1269.5248 1270.1391 1278.7613 1283.3203 1293.4251 1295.0331 1314.0890 1318.0452 1320.7031 1334.6119 1346.8179 1348.6719 1351.1798 1355.1027 1365.7124 1375.7049 1383.4415 1386.3721 1391.3068 1393.6247 1413.0898 1451.2638 1461.2810 1462.3963 1465.1412 1466.6816 1468.9517 1469.1876 1473.3096 1474.2343 1475.8876 1476.7581 1477.9467 1482.9710 1483.7992 1487.6004 1490.8787 1503.4126 1580.4773 1618.8839 1633.8266 2947.9081 2949.3719 2954.9522 2955.9301 2963.0953 2965.9415 2967.5967 2970.6725 2970.9668 2973.9197 2979.8078 2983.5355 2992.6518 2993.5819 3004.9158 3008.5112 3020.4844 3030.6894 3032.3534 3036.7099 3048.0844 3061.1819 3065.5857 3067.3371 3067.5315 3069.3513 3073.9443 3075.3875 3089.6223 3105.2796 3112.7635 3117.3974 3135.5653 3143.2232
redmass: 3.8464 4.1986 4.1611 2.9716 1.9686 3.3299 3.6989 3.2297 3.9535 2.8580 2.0806 2.7064 2.8735 2.2913 2.7179 2.7988 3.7346 3.8475 1.6903 1.4881 1.1308 1.5277 1.4749 2.3349 1.2302 3.4920 3.0265 3.4952 4.2073 2.8565 2.6969 1.9571 2.8841 3.7582 3.0621 3.0265 2.7826 3.0327 3.2270 5.9556 4.0952 3.4987 1.0788 2.8701 1.2702 1.2773 3.5396 3.0589 1.6436 3.2041 2.0697 1.5466 1.3873 1.5518 2.7475 1.6540 1.8272 1.2116 1.4461 1.6654 1.5292 1.6231 1.3853 2.2068 1.9258 1.6419 2.7860 2.9324 2.0356 2.5814 1.6117 2.1146 2.0710 2.3681 1.5127 2.1249 2.2777 2.2955 1.6649 1.9132 2.0508 1.6162 1.2492 1.7022 1.3902 2.4181 1.3003 1.3256 1.2976 1.6341 1.2680 1.5122 1.2230 1.0451 1.0979 1.1284 1.4589 1.3448 1.4197 1.3580 1.4892 1.3816 1.4862 1.6671 1.6173 1.2291 5.1069 1.2183 1.2043 1.2198 2.4476 1.0816 1.0674 1.0748 1.0468 1.0948 1.0746 1.0536 1.0826 1.0602 1.0504 1.0640 1.0537 1.0555 1.0869 1.0777 1.0687 2.5274 6.4932 6.4110 9.1933 1.0590 1.0591 1.0595 1.0783 1.0606 1.0596 1.0364 1.0385 1.0362 1.0616 1.0621 1.0960 1.0987 1.0355 1.0613 1.0993 1.0985 1.1024 1.1040 1.0845 1.1035 1.0999 1.0988 1.0998 1.1006 1.0993 1.0990 1.1076 1.1001 1.1000 1.0870 1.0874 1.0961 1.0968
irintensity: 0.2125 0.0313 0.4877 0.0344 0.0005 0.3938 0.8601 0.2918 0.0647 0.0453 0.0120 0.2389 0.6042 0.2371 0.0094 1.9340 1.1481 1.9065 0.8035 0.5720 0.1186 0.9522 1.3010 1.7508 1.9510 3.1396 4.4969 0.6398 3.7227 0.1808 0.6438 0.1145 0.4381 2.1263 2.5444 2.5743 2.0484 24.1769 5.7702 0.5568 3.4646 12.2142 12.7954 3.2395 0.6267 1.0801 1.2701 8.0727 4.1627 4.8241 3.4348 27.8146 17.3073 1.6243 6.8842 0.5211 3.0892 1.9978 10.8398 0.0138 0.0161 0.0284 0.2963 4.8052 10.6853 1.0028 6.4972 4.1668 7.1269 4.3567 19.8412 58.8498 4.0591 100.0339 3.7576 15.1281 85.5377 63.8359 79.1786 9.7065 5.0331 2.1170 2.0090 1.6430 12.2086 4.4994 1.2856 3.1587 1.6155 15.0937 1.3815 19.0184 0.2012 0.4209 0.6073 1.0279 38.0204 3.0204 1.4337 1.1417 0.1758 6.2695 7.1217 0.7430 0.6749 18.4517 2.1755 10.6850 20.1833 16.6500 9.4781 5.0476 1.0242 0.1132 3.2700 3.5461 2.4156 8.5199 10.3285 1.6090 7.8200 5.8634 15.0258 31.7040 6.1922 25.6332 10.0810 30.5769 0.6181 10.4938 160.8790 1.9125 0.1471 15.4991 20.2499 36.8857 140.2194 20.8305 34.7445 32.7208 75.4886 57.8200 4.7912 3.5210 32.4042 38.1046 2.8298 9.5618 15.4560 42.0829 7.4458 115.9770 22.7025 64.9468 2.0766 96.7138 43.4184 111.4987 30.3791 35.7795 17.8933 10.3945 14.2983 29.8419 1.4267
temp: 298.150 k
press: 1.00000 atm
elementType: 8 8 6 6 6 6 6 6 6 6 6 6 6 6 6 6 6 6 6 6 6 6 6 1 1 1 1 1 1 1 1 1 1 1 1 1 1 1 1 1 1 1 1 1 1 1 1 1 1 1 1 1 1 1 1 1 1
symmnumber: 1
zpe: 1316185.0 jmol-1
zpe.correction: 0.501308 hartree
zpe.thermalcorrener: 0.528538 hartree
zpe.thermalcorrenthalpy: 0.529483 hartree
zpe.thermalcorrgfe: 0.439884 hartree
zpe.sumelectzpe: -969.286176 hartree
zpe.sumelectthermal: -969.258946 hartree
zpe.sumelectthermalent: -969.258002 hartree
zpe.sumelectthermalfe: -969.347601 hartree
dipole: -1.9179 -0.0006 -1.0367
dipole: 2.1802
quadrupole: -150.7797 -133.9349 -141.5252
quadrupole: -0.4550 -6.6290 1.6792
quadrupole: -8.6998 8.1451 0.5547 -0.4550 -6.6290 1.6792
hfenergy: -969.7874846 hartree
pointgroup: C01 [X(C21H34O2)]
dipole: -0.7452091 0.056919 -0.4209097 debye
polarizability: 256.3243709|-28.6383324|242.1721867|8.138494|4.9664575|196.7805883 unknown
InChI: InChI=1S/C21H34O2/c1-5-6-7-8-9-10-15-23-21(22)18(4)20-13-11-19(12-14-20)16-17(2)3/h11-14,17-18H,5-10,15-16H2,1-4H3
charge 0 multiplicity 1
57 atoms
O  2.039045 -2.592601 -0.266539
O  3.513798 -1.905354 1.408142
C  -2.359929 -2.679307 -0.042905
C  -0.892135 -2.494121 0.401252
C  -3.197594 -1.387268 0.090897
C  -0.041456 -3.771403 0.223233
C  -4.6650 -1.554562 -0.362605
C  -1.488834 3.675165 0.629645
C  -0.059778 4.012264 0.078576
C  3.439178 -0.702943 -0.765143
C  1.416957 -3.596093 0.654212
C  -5.493525 -0.254618 -0.241069
C  0.851166 2.813325 -0.144732
C  2.53592 0.521516 -0.545291
C  0.875505 2.128144 -1.387125
C  1.698173 2.331951 0.889014
C  1.700079 0.997961 -1.583685
C  2.525688 1.205891 0.697136
C  3.046433 -1.780006 0.252145
C  -1.438861 3.01193 2.025753
C  -2.311189 2.817118 -0.35955
C  4.94285 -0.359936 -0.640725
C  -6.957535 -0.425115 -0.700787
H  -2.831247 -3.487648 0.555327
H  -2.382179 -3.020862 -1.099267
H  -0.8664 -2.179753 1.465691
H  -0.432677 -1.671478 -0.180646
H  -2.720493 -0.581599 -0.505745
H  -3.176527 -1.043057 1.146392
H  -0.472328 -4.599146 0.824103
H  -0.071521 -4.097531 -0.835118
H  -4.686257 -1.903535 -1.416467
H  -5.148513 -2.353255 0.238461
H  -2.004312 4.653527 0.738282
H  0.42022 4.711282 0.791821
H  -0.186679 4.562382 -0.874882
H  3.227881 -1.109867 -1.769792
H  1.995986 -4.532433 0.555879
H  1.512167 -3.224585 1.690682
H  -5.473016 0.091753 0.81282
H  -5.006404 0.543159 -0.839086
H  0.244263 2.48593 -2.209811
H  1.708024 2.849851 1.855996
H  1.695623 0.483215 -2.552396
H  3.159424 0.848849 1.517656
H  -2.460259 2.868803 2.425204
H  -0.952054 2.020465 1.977612
H  -0.875641 3.63306 2.748034
H  -1.8451 1.824934 -0.503197
H  -2.389082 3.305475 -1.34968
H  -3.336786 2.655817 0.022652
H  5.569643 -1.241886 -0.864549
H  5.205357 0.447878 -1.345513
H  5.183133 -0.026915 0.382821
H  -7.474195 -1.197307 -0.099805
H  -7.006046 -0.738656 -1.760781
H  -7.526861 0.517499 -0.600948
