program: Gaussian 09
title: 000158187
version: EM64L-G09RevD.01
frameworkgroup: C1[X(C14H16O4)]
method: RPBEPBE
basis: SDD
operation: Freq
keyword: #pfreq=noraman
keyword: PBEPBE/SDD
title: #p freq=noraman PBEPBE/SDD
converged: NO YES NO NO
title: Mulliken charges:
elementType: O O O O C C C C C C C C C C C C C C H H H H H H H H H H H H H H H H
charge: -0.232873 -0.460005 -0.185141 -0.202503 0.182621 -0.273058 -0.084482 -0.182426 -0.501339 -0.087751 -0.453473 -0.203227 0.083953 0.280566 -0.780465 -0.337854 0.066402 -0.684447 0.286547 0.239052 0.266459 0.251008 0.219248 0.281947 0.236988 0.224844 0.262511 0.237298 0.248555 0.198881 0.273246 0.337501 0.233438 0.257981
chargesum: 0.00000
title: Mulliken charges with hydrogens summed into heavy atoms:
elementType: O O O O C C C C C C C C C C C C C C
charge: -0.232873 -0.122504 -0.185141 -0.202503 0.182621 0.013489 0.154570 0.084033 -0.031083 0.194196 0.008358 0.059284 0.083953 0.280566 -0.095731 -0.064608 0.066402 -0.193028
polarizability: 1.81977042e+02 4.16656994e+00 1.72950946e+02 -3.44788512e+00 -1.02261137e+01 1.07021555e+02
1716.lowfreq: -13.2983 -0.0010 -0.0004 -0.0004 3.9103 11.4896 38.2585 75.1663 80.4610
frequency: 37.9253 75.1244 80.4316 112.0825 115.2418 160.5015 195.8709 211.0737 233.0742 257.3636 273.8996 283.6680 285.6061 300.3060 316.8203 342.4058 365.1154 389.2272 409.2230 463.2524 480.8556 537.0345 545.4435 562.5342 584.1895 609.4026 642.2377 666.7981 689.9872 704.3867 743.8945 758.4541 786.8243 808.5863 811.3327 871.9858 885.0449 915.9136 926.9971 928.8625 965.4169 979.1092 983.7269 986.2015 1004.0825 1031.1163 1043.0517 1054.8272 1069.5179 1084.8984 1097.0013 1122.5778 1150.0096 1164.5997 1178.9739 1199.1860 1215.1462 1220.3426 1242.0619 1265.7636 1272.7077 1282.2167 1299.6473 1302.9875 1312.2139 1317.3112 1340.1728 1352.8295 1358.7994 1370.0979 1397.6733 1420.7789 1470.1416 1473.3662 1484.8442 1491.9847 1593.2733 1636.2837 1675.1091 1686.4476 2952.8764 2966.8732 2981.3532 2986.3074 2990.8175 3002.0442 3043.0225 3056.4168 3060.2460 3082.8413 3098.1670 3111.4208 3149.3225 3192.2298 3206.6025 3543.6374
redmass: 4.6346 4.2496 5.9540 4.8068 2.8476 6.0507 4.6362 5.8210 2.2225 1.3452 2.1762 1.9446 2.4057 3.7135 3.6449 3.7990 4.3598 3.9682 3.5618 3.5759 3.0865 3.6921 3.1040 2.8970 3.2815 4.3771 3.5761 3.1861 4.8076 4.4655 3.5058 3.6029 2.0631 2.1583 1.7865 3.3474 2.1581 2.2378 4.5218 2.7504 1.9390 1.6518 1.6510 1.3621 2.3074 3.5236 3.3029 1.7858 2.2302 1.9742 1.4207 2.1811 2.1835 3.0773 1.8776 1.6845 1.5533 1.4498 2.0664 1.4493 1.5522 1.2290 1.2522 1.4456 1.4699 1.6154 1.4920 1.6509 1.6095 1.3446 1.2028 1.1805 1.0707 1.0620 1.0821 1.0457 7.0160 11.5063 7.0804 11.0665 1.0820 1.0414 1.0758 1.0806 1.0669 1.0612 1.1005 1.1013 1.0947 1.0995 1.0616 1.0896 1.0893 1.1051 1.1154 1.0658
irintensity: 4.9527 3.6007 0.8245 1.9963 0.3602 0.8564 1.6039 2.6124 1.1349 41.2030 19.4934 81.3723 2.6289 7.3161 3.9146 13.2944 6.9885 6.7475 3.2704 3.9978 9.9452 4.1171 11.6830 3.7620 2.3436 5.0182 4.8363 2.0677 3.7930 2.3218 2.3327 2.5174 7.2679 15.7896 22.0411 0.5684 29.3014 11.8062 89.4975 89.3738 10.2254 17.9401 37.3119 0.3625 10.7341 160.9175 11.3047 1.6843 6.9181 10.1357 18.4145 19.1814 6.0728 53.8253 2.1040 8.0379 21.7453 3.1043 70.2174 14.3121 53.3772 2.3446 0.9478 10.4937 8.3677 1.6873 12.4890 10.8788 0.9131 1.2648 16.7254 29.0597 13.5656 1.3286 11.6791 14.0423 4.1087 228.6084 48.8110 263.1625 10.8177 24.5138 16.0241 1.2554 9.0961 12.6793 15.8238 12.3921 42.8718 28.8439 3.4094 7.1853 6.0435 7.6305 3.0094 4.9206
temp: 298.150 k
press: 1.00000 atm
elementType: 8 8 8 8 6 6 6 6 6 6 6 6 6 6 6 6 6 6 1 1 1 1 1 1 1 1 1 1 1 1 1 1 1 1
symmnumber: 1
zpe: 714108.7 jmol-1
zpe.correction: 0.271990 hartree
zpe.thermalcorrener: 0.288109 hartree
zpe.thermalcorrenthalpy: 0.289053 hartree
zpe.thermalcorrgfe: 0.229262 hartree
zpe.sumelectzpe: -842.609108 hartree
zpe.sumelectthermal: -842.592989 hartree
zpe.sumelectthermalent: -842.592045 hartree
zpe.sumelectthermalfe: -842.651836 hartree
dipole: -5.5445 -2.4212 -1.4244
dipole: 6.2155
quadrupole: -127.7265 -107.9656 -105.5543
quadrupole: 21.7028 -0.7596 1.5583
quadrupole: -13.9777 5.7832 8.1945 21.7028 -0.7596 1.5583
hfenergy: -842.8810978 hartree
pointgroup: C01 [X(C14H16O4)]
dipole: 2.1249049 -1.0692792 0.5668364 debye
polarizability: 181.6919484|-4.7153541|172.4540803|-1.5410763|12.7620422|107.8035142 unknown
InChI: InChI=1S/C14H16O4/c1-7-5-12-9(8(2)13(16)18-12)6-10-11(15)3-4-14(7,10)17/h3-4,7,9-10,12,17H,2,5-6H2,1H3
charge 0 multiplicity 1
34 atoms
O  -2.709547 -1.072033 -0.762945
O  1.555192 -1.385718 -1.565995
O  2.684279 2.753537 0.341235
O  -4.683401 -0.128386 0.047466
C  1.712668 -0.756413 -0.224056
C  1.370032 0.762501 -0.391645
C  0.846739 -1.491921 0.848625
C  -1.183928 0.791468 -0.487099
C  0.070547 1.299457 0.24258
C  -1.2384 -0.755807 -0.667389
C  -0.679722 -1.605628 0.493748
C  3.200309 -0.741083 0.136676
C  2.61834 1.513444 0.135504
C  -2.520534 1.097351 0.166798
C  1.392786 -2.90137 1.193734
C  3.695869 0.511319 0.340987
C  -3.458901 -0.03525 -0.149103
C  -2.904676 2.169955 0.900605
H  1.337316 0.943318 -1.486202
H  0.943603 -0.879718 1.767404
H  -1.194948 1.234738 -1.505899
H  0.113123 2.404098 0.197401
H  0.019315 1.035902 1.315522
H  -0.794716 -1.07346 -1.620754
H  -0.908953 -2.656486 0.234285
H  -1.267732 -1.38463 1.406149
H  3.781981 -1.667425 0.193323
H  2.404841 -2.865617 1.633946
H  0.729685 -3.388399 1.930666
H  1.419449 -3.564882 0.305737
H  4.719459 0.785452 0.60717
H  1.816373 -2.341022 -1.506653
H  -2.222573 2.995565 1.131342
H  -3.930476 2.230445 1.282239
