program: Gaussian 09
title: 000158184
version: EM64L-G09RevD.01
frameworkgroup: C1[X(C16H20N2)]
method: RPBEPBE
basis: SDD
operation: Freq
keyword: #pfreq=noraman
keyword: PBEPBE/SDD
title: #p freq=noraman PBEPBE/SDD
converged: YES YES NO NO
title: Mulliken charges:
elementType: N N C C C C C C C C C C C C C C C C H H H H H H H H H H H H H H H H H H H H
charge: -0.128916 -0.302536 0.011952 -0.240910 -0.156822 -0.527112 -0.474230 -0.172387 0.535902 -0.256713 -0.250330 -0.592897 -0.490451 -0.245227 -0.234016 -0.493451 -0.236885 -0.206662 0.243171 0.238979 0.240888 0.196411 0.221961 0.214184 0.219536 0.229462 0.221819 0.270916 0.216326 0.215677 0.214052 0.208592 0.219071 0.217664 0.218301 0.220782 0.218290 0.215607
chargesum: 0.00000
title: Mulliken charges with hydrogens summed into heavy atoms:
elementType: N N C C C C C C C C C C C C C C C C
charge: -0.128916 -0.031620 0.255124 -0.001931 0.084066 -0.108739 -0.040510 0.057075 0.535902 -0.034894 -0.034004 -0.163168 -0.062789 -0.027563 -0.015715 -0.272669 -0.018595 0.008945
polarizability: 2.37111866e+02 -2.09754810e+00 1.86658428e+02 4.92989465e+00 1.82475864e+00 1.15692037e+02
1716.lowfreq: -13.9182 0.0003 0.0003 0.0005 2.6569 11.0151 25.2198 48.1494 90.1138
frequency: 23.9041 48.1426 90.1000 112.9212 132.1866 185.3312 192.9240 255.1650 258.3278 272.6728 283.6883 329.1720 374.1234 420.3072 441.7508 453.9923 470.6152 502.7251 510.6326 522.0636 542.8956 562.3053 588.5201 592.4912 655.0039 689.5877 702.4774 705.9239 744.1399 777.7779 790.4940 799.9106 803.9918 881.6416 903.1841 916.9899 944.6834 954.7680 959.3219 964.1056 965.8144 967.3673 979.0091 997.2231 1006.8234 1011.0212 1028.9224 1032.7508 1065.6298 1077.3601 1083.6632 1093.7025 1108.1969 1121.4005 1134.3722 1151.3236 1163.4972 1174.7589 1186.5719 1187.9625 1200.6061 1214.4167 1229.5857 1253.1090 1262.9665 1271.4216 1288.6133 1290.9176 1308.3728 1310.1909 1317.1793 1325.3898 1332.2180 1349.9197 1362.3354 1363.7348 1369.0439 1390.4902 1409.5467 1426.8299 1443.0361 1451.2136 1456.0401 1485.5454 1607.2664 1612.5441 1648.4330 1658.3677 2884.9966 2893.2432 2897.6749 2905.4321 2920.0769 2960.6186 2967.9655 2988.6228 3018.1740 3025.6957 3028.0792 3030.9520 3098.2533 3102.3291 3102.3627 3116.8888 3128.2468 3146.2932 3147.6776 3373.4035
redmass: 3.8075 3.6238 3.4385 3.3863 3.9165 2.8955 3.2031 2.9342 3.5586 2.9248 2.6517 2.9395 2.6322 3.0241 2.8990 3.3848 2.9552 3.5439 3.8867 3.0149 3.2994 2.7684 4.2435 3.0645 3.1240 2.6826 1.4946 1.3811 3.4465 2.3742 1.5957 2.5780 2.2123 1.6846 2.0053 3.2662 3.0749 2.0175 1.6878 1.4773 1.7101 2.4913 1.3115 2.4434 2.1777 3.2268 2.4764 2.4569 2.7003 2.1827 3.1862 3.6112 2.5284 1.9249 2.0421 1.1938 1.3099 1.2121 1.0924 1.1122 1.3242 1.6172 1.2771 1.2202 1.2636 1.2790 1.3555 1.3183 1.3455 1.3080 1.4117 1.5310 1.5929 1.4848 1.5344 1.4923 1.5780 1.7778 1.7613 1.1023 1.0954 1.2067 1.0916 1.0888 8.4923 8.4069 5.9963 6.0050 1.0784 1.0689 1.0682 1.0743 1.0734 1.0807 1.0628 1.0836 1.0915 1.0950 1.0959 1.0935 1.0839 1.0866 1.0868 1.0878 1.0962 1.1010 1.1003 1.0751
irintensity: 0.0006 0.6704 0.2266 0.2573 3.0009 3.3983 0.1198 0.5616 0.3018 1.5139 4.9785 0.9349 6.2273 3.2211 14.4869 1.1430 3.1097 2.2727 0.9668 2.8890 5.9198 2.1061 4.9305 10.8333 3.5351 9.0334 127.9963 54.0343 1.9129 7.6013 10.5207 8.1664 23.4895 4.9493 1.2673 1.0393 0.4566 7.0879 1.2828 3.1444 0.4077 24.3295 0.5802 3.8386 2.7904 21.0499 1.9285 7.9990 3.3067 8.3543 0.1268 3.6021 1.6343 0.7882 16.5837 0.6983 2.9444 8.7857 3.0717 1.1458 0.8130 2.1531 10.5357 3.3421 3.5884 4.4762 4.1466 6.1869 0.2072 0.8310 9.8618 0.3391 2.8771 13.9233 1.8397 4.4340 4.4876 2.5593 1.4595 18.8889 2.0166 8.3743 17.7766 5.1847 8.4518 20.3337 0.9189 0.3528 18.9490 120.3365 14.6923 6.8665 50.0902 5.3751 35.6284 39.8305 10.7528 53.8285 16.2478 62.7102 7.4519 12.6083 4.9139 19.9001 51.5136 60.7489 37.4671 2.3418
temp: 298.150 k
press: 1.00000 atm
elementType: 7 7 6 6 6 6 6 6 6 6 6 6 6 6 6 6 6 6 1 1 1 1 1 1 1 1 1 1 1 1 1 1 1 1 1 1 1 1
symmnumber: 1
zpe: 850991.4 jmol-1
zpe.correction: 0.324126 hartree
zpe.thermalcorrener: 0.339022 hartree
zpe.thermalcorrenthalpy: 0.339966 hartree
zpe.thermalcorrgfe: 0.281926 hartree
zpe.sumelectzpe: -729.760384 hartree
zpe.sumelectthermal: -729.745488 hartree
zpe.sumelectthermalent: -729.744544 hartree
zpe.sumelectthermalfe: -729.802584 hartree
dipole: -0.4509 0.6359 0.5526
dipole: 0.9556
quadrupole: -106.0091 -95.6834 -112.3046
quadrupole: -2.2402 1.8974 0.2667
quadrupole: -1.3434 8.9823 -7.6389 -2.2402 1.8974 0.2667
hfenergy: -730.0845096 hartree
pointgroup: C01 [X(C16H20N2)]
dipole: -0.1748219 0.2479321 0.2220666 debye
polarizability: 237.0342583|-2.8096348|186.6179324|5.134567|3.1720009|115.8101398 unknown
InChI: InChI=1S/C16H20N2/c1-2-6-13-10-17-18-11-14-7-3-4-8-15(14)16(18)9-12(13)5-1/h1-4,6-8,12,14-17H,5,9-11H2
charge 0 multiplicity 1
38 atoms
N  -0.620157 1.373486 0.393039
N  0.445083 2.021765 -0.436149
C  -0.629195 -0.100931 0.122722
C  -2.008032 -0.525294 0.723637
C  -2.917942 0.760614 0.580561
C  0.583489 -0.827649 0.72871
C  -1.969356 1.830084 -0.043136
C  1.908688 -0.680375 -0.066848
C  2.56471 0.710861 -0.022095
C  -2.545294 -1.783081 0.070676
C  -4.184088 0.584309 -0.236719
C  1.748721 1.947855 0.303855
C  2.915614 -1.778115 0.37136
C  -3.716566 -1.813816 -0.631042
C  -4.54656 -0.608794 -0.792672
C  3.895918 0.816781 -0.33117
C  4.27819 -1.614917 -0.280057
C  4.727825 -0.365112 -0.602865
H  -0.641476 -0.26913 -0.98182
H  -1.845282 -0.727303 1.802043
H  -3.199668 1.109468 1.593172
H  0.341665 -1.909829 0.767675
H  0.716038 -0.489483 1.776079
H  -2.057939 1.825231 -1.156688
H  -2.174889 2.850821 0.328533
H  1.664984 -0.863468 -1.139755
H  -1.944334 -2.69599 0.181132
H  0.168792 3.015844 -0.512186
H  -4.818807 1.472015 -0.364171
H  1.540838 1.992302 1.398956
H  2.341574 2.843485 0.037164
H  2.489671 -2.772214 0.135412
H  3.038284 -1.749292 1.479636
H  -4.058717 -2.749412 -1.089981
H  -5.473137 -0.68659 -1.374548
H  4.367024 1.807393 -0.38568
H  4.909425 -2.500229 -0.42619
H  5.726308 -0.221788 -1.033588
