program: Gaussian 09
title: 000158182
version: EM64L-G09RevD.01
frameworkgroup: C1[X(C16H18N2)]
method: RPBEPBE
basis: SDD
operation: Freq
keyword: #pfreq=noraman
keyword: PBEPBE/SDD
title: #p freq=noraman PBEPBE/SDD
converged: YES YES NO NO
title: Mulliken charges:
elementType: N N C C C C C C C C C C C C C C C C H H H H H H H H H H H H H H H H H H
charge: -0.080959 -0.405653 -0.198872 -0.253693 -0.596554 0.481115 0.385324 -0.205231 -0.420452 -0.476637 0.408205 0.224715 -0.448477 -0.485585 -0.639604 -0.370998 -0.823643 -0.205628 0.238066 0.237780 0.215709 0.237585 0.243148 0.180284 0.217820 0.262522 0.235909 0.220602 0.188079 0.225988 0.300341 0.225193 0.220273 0.233273 0.216532 0.213524
chargesum: 0.00000
title: Mulliken charges with hydrogens summed into heavy atoms:
elementType: N N C C C C C C C C C C C C C C C C
charge: -0.080959 -0.105312 0.039194 -0.015912 -0.143260 0.481115 0.385324 -0.205231 -0.177304 -0.078533 0.408205 0.224715 -0.185955 -0.249676 -0.004935 -0.145805 -0.153565 0.007897
polarizability: 2.30384585e+02 8.85245583e+00 1.84397970e+02 2.34418701e+00 2.11782359e+01 1.26450996e+02
1716.lowfreq: -12.8222 -4.6454 0.0001 0.0005 0.0006 10.6995 56.0987 74.4792 128.0617
frequency: 56.0863 74.4041 128.0470 147.1477 154.4477 178.0171 205.9625 226.3065 233.9581 250.0723 272.8814 291.9003 317.4954 359.5691 403.5415 424.6892 438.4053 461.5165 481.7531 490.3894 491.3920 535.0684 560.9070 584.7194 603.6347 621.9866 699.0673 712.8621 735.8248 754.3623 776.6246 792.1686 809.2428 827.7389 846.9214 878.1872 885.1281 894.9027 949.9985 958.7449 972.1096 988.7715 1024.1442 1030.7178 1043.1092 1051.8116 1056.9614 1090.3350 1100.2469 1111.6026 1126.5030 1148.6164 1154.7302 1171.6527 1186.7505 1201.8504 1213.6518 1223.4506 1246.0467 1257.9913 1266.9028 1283.9009 1296.0414 1315.1548 1329.0589 1344.8026 1356.8933 1377.6421 1395.6232 1405.3791 1417.1076 1430.9674 1448.7130 1456.3943 1460.0359 1461.8864 1470.5349 1475.1239 1491.7475 1500.5162 1565.5777 1617.7609 1629.5410 1693.2062 2789.2359 2856.4510 2955.5421 2959.1560 2961.6318 2970.2854 2994.7990 3004.8153 3027.6677 3032.5552 3067.8914 3082.0346 3107.6632 3117.3345 3132.3632 3153.6606 3217.2050 3613.4491
redmass: 4.0109 3.9633 2.6008 1.9570 2.5314 1.3496 3.7106 1.1844 2.9232 2.5452 3.7468 3.6327 3.1944 4.0630 3.3617 2.7323 3.0724 4.6870 4.1562 2.3205 1.6959 2.8653 5.2869 4.9933 3.3915 3.8694 2.8821 3.2130 3.9338 1.4848 1.8231 2.4187 2.2265 4.1830 2.0783 1.6056 3.5594 2.6053 1.3550 1.8166 1.7879 2.0402 2.5289 2.5152 1.8615 2.0155 1.6888 2.4750 2.2846 1.5157 2.7932 1.5173 1.4962 1.3490 1.7397 1.3792 1.3215 1.6822 1.7403 1.6953 1.6467 2.0579 2.1780 1.4353 1.3362 2.4093 1.5237 1.8884 1.2364 2.8428 3.2654 1.1759 1.5876 1.8048 1.1684 1.0479 1.0683 1.0863 1.0676 3.3944 6.8352 7.1308 8.2921 7.1370 1.0719 1.0567 1.0678 1.0529 1.0793 1.0635 1.0844 1.0728 1.0968 1.0985 1.0999 1.0978 1.0917 1.0862 1.0910 1.0983 1.0981 1.0807
irintensity: 0.4382 1.1181 2.3229 0.2678 1.4643 0.6834 10.4454 0.6293 2.6430 0.0680 2.4419 0.6180 0.0507 4.1104 12.3456 0.8266 3.9945 0.1736 1.4270 31.0710 69.2659 6.4099 0.3901 1.5821 1.1751 1.3438 1.7463 9.9398 2.5282 76.1038 39.6586 1.9109 2.6898 2.6591 16.2750 0.2508 7.7022 1.7094 2.0422 6.8305 3.3993 0.5324 6.0970 17.6070 7.4756 41.8616 9.4066 6.7906 19.1789 1.3214 16.5502 13.3219 6.3737 2.7775 14.6062 11.1439 0.2581 4.9146 16.5803 1.0916 4.4131 9.2223 10.5574 7.3091 1.9165 35.4774 6.6283 0.7393 11.5761 6.5818 8.0209 6.6203 3.7450 37.8593 11.0446 13.6847 4.5264 10.3442 10.1264 1.7446 1.8951 13.9523 8.7970 2.9107 88.5895 131.9009 16.7360 94.9240 25.4070 24.3058 31.6152 62.7653 28.4423 34.4896 32.6962 23.6839 19.8253 5.4085 19.9887 38.8630 2.0152 57.0361
temp: 298.150 k
press: 1.00000 atm
elementType: 7 7 6 6 6 6 6 6 6 6 6 6 6 6 6 6 6 6 1 1 1 1 1 1 1 1 1 1 1 1 1 1 1 1 1 1
symmnumber: 1
zpe: 792235.2 jmol-1
zpe.correction: 0.301746 hartree
zpe.thermalcorrener: 0.316831 hartree
zpe.thermalcorrenthalpy: 0.317775 hartree
zpe.thermalcorrgfe: 0.260811 hartree
zpe.sumelectzpe: -728.693363 hartree
zpe.sumelectthermal: -728.678278 hartree
zpe.sumelectthermalent: -728.677334 hartree
zpe.sumelectthermalfe: -728.734299 hartree
dipole: -0.4771 1.9286 1.3040
dipole: 2.3764
quadrupole: -90.1426 -98.9219 -108.5676
quadrupole: -3.3750 -2.0785 2.9255
quadrupole: 9.0681 0.2888 -9.3569 -3.3750 -2.0785 2.9255
hfenergy: -728.9951094 hartree
pointgroup: C01 [X(C16H18N2)]
dipole: -0.2032467 0.7677873 0.493303 debye
polarizability: 230.0934357|9.2363373|185.5620279|3.1190916|19.9761322|125.5780868 unknown
InChI: InChI=1S/C16H18N2/c1-10-6-13-12-4-3-5-14-16(12)11(8-17-14)7-15(13)18(2)9-10/h3-6,8,13,15,17H,7,9H2,1-2H3
charge 0 multiplicity 1
36 atoms
N  2.636616 0.731689 -0.905692
N  -3.151014 1.50524 0.841304
C  1.157478 0.73356 -0.794138
C  0.686287 -0.761483 -0.745421
C  0.606586 1.61249 0.394599
C  -0.825764 -0.876784 -0.56484
C  -0.889066 1.449305 0.498568
C  -1.477611 0.220384 0.036875
C  1.461243 -1.512122 0.336826
C  3.340694 0.146858 0.252522
C  2.674488 -1.10649 0.795312
C  -2.887592 0.259885 0.253668
C  -1.938816 2.225493 0.98405
C  -1.633248 -1.966975 -0.943805
C  3.235606 1.996168 -1.3577
C  -3.699779 -0.837114 -0.119121
C  3.441612 -1.848678 1.871038
C  -3.045631 -1.940555 -0.71524
H  0.761998 1.171564 -1.732514
H  0.96137 -1.203055 -1.726197
H  0.898625 2.667759 0.236757
H  1.088409 1.277478 1.335348
H  0.995889 -2.420714 0.741887
H  3.453815 0.879963 1.099006
H  4.37712 -0.098916 -0.063624
H  -1.937792 3.222254 1.422203
H  -1.186925 -2.844502 -1.427295
H  4.295827 1.827196 -1.625149
H  3.210133 2.816292 -0.596181
H  2.710253 2.353603 -2.261434
H  -4.067707 1.85108 1.114663
H  -4.784599 -0.846287 0.033862
H  4.416492 -2.214441 1.490973
H  2.873399 -2.718198 2.243453
H  3.66416 -1.190501 2.734956
H  -3.645253 -2.805746 -1.021517
