program: Gaussian 09
title: 000158226
version: EM64L-G09RevD.01
frameworkgroup: C1[X(C23H22O13)]
method: RPBEPBE
basis: SDD
operation: Freq
keyword: #p
keyword: freq=noraman
keyword: PBEPBE/SDD
title: #p freq=noraman PBEPBE/SDD
converged: NO YES NO NO
title: Mulliken charges:
elementType: O O O O O O O O O O O O O C C C C C C C C C C C C C C C C C C C C C C C H H H H H H H H H H H H H H H H H H H H H H
charge: -0.255174 -0.294792 -0.462253 -0.454838 -0.457915 -0.254695 -0.224858 -0.288219 -0.255547 -0.417350 -0.341584 -0.428668 -0.471276 -0.144797 -0.104418 -0.175022 -0.113519 -0.019758 0.233069 0.352352 0.013961 -0.629599 0.274294 0.014013 0.110883 0.255604 -0.499896 0.246030 -0.423669 0.392943 -0.536746 -0.464024 -0.388351 0.186102 -0.344398 0.137402 0.227719 0.256817 0.265617 0.250958 0.214614 0.369871 0.367971 0.368952 0.278022 0.237250 0.244471 0.248927 0.250585 0.384940 0.260335 0.226940 0.258074 0.291480 0.232335 0.230052 0.388086 0.380697
chargesum: 0.00000
title: Mulliken charges with hydrogens summed into heavy atoms:
elementType: O O O O O O O O O O O O O C C C C C C C C C C C C C C C C C C C C C C C
charge: -0.255174 -0.294792 -0.092382 -0.086867 -0.088963 -0.254695 -0.224858 -0.288219 -0.255547 -0.032409 -0.341584 -0.040581 -0.090579 0.082922 0.152399 0.090596 0.137439 0.194856 0.233069 0.352352 0.013961 -0.351577 0.274294 0.014013 0.110883 0.255604 0.230752 0.246030 -0.173084 0.392943 0.208602 -0.172544 -0.156016 0.186102 -0.114346 0.137402
polarizability: 4.66166325e+02 4.81994988e+01 3.46007718e+02 -4.58170713e+01 8.21620813e+00 2.03096391e+02
1716.lowfreq: -3.8400 -0.0008 0.0004 0.0005 2.2573 6.9401 11.3767 13.9981 14.6647
frequency: 10.3338 13.9708 14.4208 23.8572 35.4111 42.6887 54.2843 63.9989 79.4092 86.6577 94.3162 99.1529 102.4253 103.8152 118.7345 125.6854 139.8585 157.1153 173.4031 191.0636 197.4366 203.0562 209.5916 222.4287 226.8533 229.0964 246.3652 253.5993 270.4711 274.4192 282.4732 285.2464 303.1958 305.6328 317.9008 328.7188 344.9357 358.0063 380.1974 392.0747 402.3494 412.2022 416.6348 428.8790 433.4198 439.3169 446.4806 463.1895 485.2759 494.7095 498.4648 505.5410 531.5457 544.9268 555.8102 566.0181 569.8368 583.4495 603.0095 613.0156 615.6790 632.8874 663.2155 668.5328 682.7896 700.0555 712.5866 722.6621 730.0264 756.6723 763.2329 792.6703 821.7626 837.0008 847.9495 852.2771 861.9275 907.6106 912.0808 919.0392 928.8476 940.3884 944.2848 962.6781 971.1883 971.6475 991.4374 1008.7612 1029.0989 1035.7650 1037.5769 1058.5368 1061.0853 1069.7495 1077.4226 1083.9983 1108.9402 1114.5201 1114.7220 1137.5259 1144.3446 1151.3837 1153.5593 1160.8866 1178.9819 1179.0925 1192.9898 1207.5907 1214.5940 1219.6019 1250.5165 1252.8563 1267.2378 1271.9074 1285.7339 1299.9096 1308.6998 1312.4493 1314.0805 1317.7868 1333.3042 1348.0382 1359.1333 1379.1113 1381.5833 1388.5226 1397.2993 1399.1584 1405.6296 1413.8462 1422.9096 1439.2388 1453.2801 1453.8632 1461.4562 1462.7078 1466.7091 1477.0259 1507.9567 1553.6331 1570.9668 1585.2896 1602.0823 1629.7106 1650.1727 1653.6786 2609.4536 2921.0601 2960.8028 2996.4961 2996.9002 3008.5100 3011.8251 3019.2291 3106.8812 3112.7641 3130.3898 3133.7007 3156.4520 3171.3864 3178.8000 3194.7939 3197.8306 3530.1992 3554.4981 3562.5674 3573.0628 3618.5045
redmass: 6.5801 6.8013 5.8642 5.6204 7.3031 6.6521 6.0745 6.3879 5.2166 3.3853 7.0842 1.2732 3.0854 3.7561 5.1625 5.9012 2.3821 2.0108 5.4101 6.2424 4.2596 5.0689 6.0325 4.9873 4.9977 6.2123 6.6512 6.3588 4.9150 5.7823 5.8236 5.2962 1.2877 3.3677 6.0083 5.7444 6.8588 6.5617 3.5626 1.6852 3.1096 1.6528 2.9960 1.4144 4.5833 3.2630 4.8937 5.1436 1.1128 6.7437 7.4249 6.4724 7.0716 6.6908 5.2625 5.0157 5.4827 6.0047 3.8229 5.9195 6.4478 5.9217 5.1005 4.1057 6.8269 5.8562 6.1334 4.0567 4.3541 4.8098 6.1740 1.5082 7.3740 1.6989 1.6793 7.4563 6.6956 1.5338 5.2551 1.3613 6.0576 7.8111 5.6084 5.5524 1.1923 3.9264 8.9568 3.4727 3.7581 3.8200 3.8819 3.4437 4.4323 2.6727 2.2437 4.3463 2.8085 1.2712 1.2879 2.3563 1.6012 1.3146 1.5791 1.3859 1.4191 1.5551 1.6986 3.1066 1.1813 1.1803 1.3147 1.8876 2.3198 1.2279 2.1373 2.9804 1.5034 1.2935 3.0018 1.2522 2.4837 1.5146 1.5702 1.7412 6.6236 1.7071 2.9072 1.3807 5.5680 2.4943 1.2078 2.1113 3.1007 1.0717 1.0523 3.2587 1.0676 1.0543 3.5921 5.4203 4.6629 6.6287 7.0941 6.6849 4.3045 8.5732 1.0750 1.0832 1.0822 1.0805 1.0313 1.0304 1.0841 1.0853 1.1056 1.1049 1.0899 1.1043 1.1050 1.0945 1.0930 1.0920 1.0915 1.0650 1.0657 1.0657 1.0660 1.0667
irintensity: 0.0908 0.8439 1.6633 1.6245 2.7350 0.6321 1.9847 0.8287 0.2723 2.4150 0.0706 0.6894 3.0458 8.4448 1.2711 1.8039 1.1377 5.2296 1.7850 8.4113 4.1411 1.4249 9.5855 7.8742 2.0975 12.2629 4.7069 2.6000 1.6651 1.3499 20.4579 1.5958 133.8358 44.5877 1.7035 25.9131 0.8999 26.7387 37.6313 78.2285 28.5578 33.3796 57.7164 212.7809 35.7587 11.8914 17.9613 20.0393 139.8068 12.5173 5.4500 38.0754 11.8805 16.2554 13.0628 28.3117 17.0429 12.2508 5.0036 43.7794 10.2051 8.6965 31.8013 10.3391 6.6600 3.5043 4.8629 1.3920 0.7588 4.5375 44.2396 39.2989 21.9214 20.1613 40.7876 3.8095 11.1902 18.5485 1.3213 0.0356 57.5906 63.8534 8.7203 183.1438 137.7263 73.8589 253.4614 97.1249 100.7017 3.0838 60.9579 127.6400 71.9171 50.1588 354.0750 60.0502 21.7362 0.0736 28.1099 145.0460 80.6355 7.9476 56.1264 26.3847 58.1311 83.8239 25.2870 17.7591 25.4398 28.5086 54.6053 260.5953 32.0422 14.2405 323.9403 92.8189 27.7480 70.8832 166.9276 7.5113 422.8893 22.8096 28.0050 10.9913 101.4149 47.3542 124.2011 1.1803 84.7757 69.4805 21.0502 308.1682 11.4256 20.4144 12.9969 96.9463 12.6529 16.9785 165.1537 3.8952 152.7066 416.4678 36.3665 31.6336 163.1705 177.4820 543.2366 26.3500 24.2917 2.4911 57.4391 29.3851 9.9766 49.0869 15.9635 21.8693 17.8579 18.8550 12.9942 3.9610 0.2145 1.5985 3.7292 108.2822 24.6154 27.4873 19.9471 129.2282
temp: 298.150 k
press: 1.00000 atm
elementType: 8 8 8 8 8 8 8 8 8 8 8 8 8 6 6 6 6 6 6 6 6 6 6 6 6 6 6 6 6 6 6 6 6 6 6 6 1 1 1 1 1 1 1 1 1 1 1 1 1 1 1 1 1 1 1 1 1 1
symmnumber: 1
zpe: 1112717.4 jmol-1
zpe.correction: 0.423812 hartree
zpe.thermalcorrener: 0.458480 hartree
zpe.thermalcorrenthalpy: 0.459424 hartree
zpe.thermalcorrgfe: 0.354143 hartree
zpe.sumelectzpe: -1864.852192 hartree
zpe.sumelectthermal: -1864.817524 hartree
zpe.sumelectthermalent: -1864.816580 hartree
zpe.sumelectthermalfe: -1864.921861 hartree
dipole: -7.3696 -4.0710 2.8411
dipole: 8.8857
quadrupole: -140.7044 -222.7813 -198.8965
quadrupole: 4.4063 -8.8914 11.0298
quadrupole: 46.7564 -35.3206 -11.4358 4.4063 -8.8914 11.0298
hfenergy: -1865.2760037 hartree
pointgroup: C01 [X(C23H22O13)]
dipole: -2.9066806 1.9200976 -0.2927404 debye
polarizability: 467.1580747|-60.8660949|317.4916037|15.3274437|59.8230262|230.6207559 unknown
InChI: InChI=1S/C23H22O13/c1-32-20-14(35-23-19(30)17(28)18(29)21(36-23)22(31)33-2)7-13-15(16(20)27)11(26)6-12(34-13)8-3-4-9(24)10(25)5-8/h3-7,17-19,21,23-25,27-30H,1-2H3
charge 0 multiplicity 1
58 atoms
O  3.316544 0.24215 -0.064788
O  2.092416 -0.347867 1.867638
O  6.070427 2.410843 2.253897
O  6.013414 2.751066 -0.610236
O  3.524471 1.668862 3.42037
O  4.015737 1.424198 -3.15019
O  5.216053 -0.347955 -2.224335
O  -2.549926 -0.061742 0.510231
O  2.381672 -2.78686 0.643325
O  0.171016 -3.885939 -0.854938
O  -2.269785 -3.684357 -1.545672
O  -5.752325 3.607099 1.390071
O  -8.170404 2.862755 0.447737
C  4.854059 2.143219 1.483743
C  5.319997 1.676886 0.09584
C  3.976359 1.080956 2.156261
C  4.092507 1.293919 -0.761562
C  2.802854 0.7315 1.227348
C  4.518653 0.679879 -2.092981
C  0.986001 -0.880486 1.152067
C  1.168908 -2.12885 0.493145
C  -0.243476 -0.186634 1.174215
C  -1.320693 -0.754307 0.482548
C  -1.200276 -1.984385 -0.215463
C  0.052678 -2.680552 -0.202189
C  -2.359139 -2.549657 -0.90838
C  4.400633 0.952847 -4.505402
C  -3.666421 -0.585006 -0.152136
C  -3.584954 -1.782637 -0.843838
C  -4.854855 0.277027 -0.014049
C  3.099673 -3.19501 -0.593037
C  -4.745205 1.541552 0.629719
C  -6.118063 -0.140196 -0.51733
C  -5.870259 2.368173 0.760507
C  -7.249426 0.688491 -0.38593
C  -7.126668 1.939231 0.249413
H  4.259128 3.077406 1.376368
H  5.971866 0.786885 0.214353
H  4.551892 0.148724 2.327118
H  3.470484 2.191198 -0.9510
H  2.13388 1.606275 1.048176
H  5.799468 2.638502 3.180017
H  6.74616 3.06566 -0.020101
H  3.017073 0.980323 3.920321
H  -0.352973 0.752983 1.720435
H  3.947765 1.679811 -5.192955
H  4.006169 -0.062331 -4.678092
H  5.498967 0.940663 -4.600541
H  -4.453535 -2.18064 -1.369995
H  -0.765451 -4.089233 -1.277516
H  2.451127 -3.816599 -1.231588
H  3.960718 -3.776693 -0.232302
H  3.452006 -2.29246 -1.122139
H  -3.787366 1.88313 1.02666
H  -6.232512 -1.112428 -1.003355
H  -8.219875 0.356675 -0.774158
H  -6.637698 4.057691 1.395437
H  -9.031589 2.544543 0.085339
