program: Gaussian 09
title: 000158316
version: EM64L-G09RevD.01
frameworkgroup: C1[X(C19H12F4N2O2)]
method: RPBEPBE
basis: SDD
operation: Freq
keyword: #p
keyword: freq=noraman
keyword: PBEPBE/SDD
title: #p freq=noraman PBEPBE/SDD
converged: YES YES NO NO
title: Mulliken charges:
elementType: F F F F O O N N C C C C C C C C C C C C C C C C C C C H H H H H H H H H H H H
charge: -0.167160 -0.163562 -0.167248 -0.204096 -0.281810 -0.223748 -0.454647 -0.067716 0.055617 0.401993 0.327369 0.063628 -0.534948 0.138449 0.508990 -0.309772 -0.354514 -0.281991 -0.198187 0.260328 -0.305099 -0.414083 -0.184755 -0.310494 -0.364653 -0.342165 0.319462 0.296963 0.322827 0.263345 0.320307 0.266703 0.236527 0.313719 0.226940 0.240587 0.249715 0.259360 0.257819
chargesum: 0.00000
title: Mulliken charges with hydrogens summed into heavy atoms:
elementType: F F F F O O N N C C C C C C C C C C C C C C C C C C C
charge: -0.167160 -0.163562 -0.167248 -0.204096 -0.281810 -0.223748 -0.134340 -0.067716 0.055617 0.401993 0.327369 0.063628 -0.237985 0.138449 0.508990 0.013055 -0.091169 -0.015288 0.038340 0.260328 0.008620 -0.187144 0.055832 -0.060779 -0.105293 -0.084346 0.319462
polarizability: 3.11246073e+02 -2.21281625e+01 2.84846485e+02 1.06124696e+01 1.60898815e+01 1.32451993e+02
1716.lowfreq: -7.3323 -3.7539 -1.8507 -0.0004 0.0001 0.0008 10.1705 12.1571 14.6424
frequency: 9.8712 11.9624 14.6213 27.3682 43.3538 57.6787 70.5316 77.3015 116.3801 124.7312 139.6626 160.4144 179.2907 190.2327 225.0948 244.1360 269.1631 303.7150 305.2457 336.4782 340.9008 368.2347 382.2041 392.8030 405.1934 415.4982 430.5610 465.9232 480.6571 500.9506 517.7806 518.9532 564.6326 576.7083 606.4623 612.8331 624.5425 630.4594 650.3652 660.4601 693.6191 696.5098 709.0151 717.0429 736.7377 769.2328 786.3871 805.6838 807.6067 808.5828 835.1851 844.9170 864.8803 909.0421 913.8124 929.4841 932.9812 939.5184 974.5871 976.2744 984.9350 985.7621 999.8547 1000.7993 1017.1311 1034.9342 1048.9195 1067.3019 1096.1228 1112.7222 1125.9457 1149.7103 1158.8961 1185.6267 1199.6366 1214.6324 1259.4623 1263.6893 1273.6575 1276.7993 1298.2252 1300.4596 1326.7826 1370.1404 1389.7043 1406.9732 1409.8149 1421.4386 1440.9264 1475.2068 1493.6426 1503.1432 1552.2040 1569.6540 1586.8669 1602.5900 1613.8027 1617.9887 1622.8839 3125.1797 3140.5245 3145.8252 3149.6501 3172.1206 3174.5056 3179.1093 3180.3933 3181.3675 3201.1046 3208.8309 3522.6039
redmass: 10.4469 8.8296 9.4585 5.1508 5.5349 6.9978 7.4231 8.2718 7.4273 8.5412 6.4924 6.5343 7.5073 7.2522 5.8929 8.2058 7.2503 9.7272 7.5201 9.1595 7.4836 6.3106 6.4287 6.3277 4.9398 3.1774 5.0733 7.7185 5.0200 4.6061 3.0245 6.5852 5.1181 7.7195 9.9389 6.7464 7.3374 8.0603 1.2668 5.2415 7.9136 2.4903 5.0267 5.2167 6.9320 3.5660 6.4598 1.4906 1.4183 1.4587 5.0406 1.5121 7.1158 6.6826 1.5312 1.3628 1.3656 1.3842 1.3840 1.3150 9.8783 6.2676 1.3238 2.8912 5.2231 4.5312 3.5775 2.3275 1.7253 1.3219 1.7390 2.0264 1.4890 1.2037 1.8038 2.3231 2.4844 2.0277 2.7824 2.5699 1.4380 1.7095 10.7093 5.7671 6.8645 3.5232 3.5373 2.1949 2.9738 2.6948 2.3828 2.3474 6.1661 6.1485 7.0192 9.3886 4.7091 6.4063 6.5857 1.0903 1.0890 1.0923 1.0886 1.0914 1.0960 1.0953 1.0934 1.0993 1.0957 1.0950 1.0766
irintensity: 0.1852 0.2895 0.1725 1.9079 0.9544 1.6801 2.0710 0.7290 1.9959 1.6298 1.5164 0.4882 3.4764 1.3355 0.6628 1.0438 5.0632 2.9604 1.7555 5.0765 1.8542 2.0221 1.6765 1.4334 8.0707 0.2083 0.3301 12.7053 3.2021 15.0179 24.8781 5.3484 7.6405 4.9737 9.1516 2.1677 1.8889 5.8321 46.2023 3.6534 0.8200 22.6018 1.2144 0.5254 4.4350 36.1741 17.6927 107.0476 4.1882 24.4963 25.4661 80.5059 29.0174 156.9685 62.6483 0.3299 0.1579 0.9719 2.2919 2.3506 200.1457 4.2959 4.5843 5.7661 132.7943 30.8098 106.8914 3.6826 0.3178 20.3140 25.3745 38.4836 56.5866 7.4456 64.3814 11.4221 6.9889 152.6121 570.4309 39.7103 30.1733 148.4422 55.3171 131.8836 17.1912 226.0911 206.1855 96.8500 114.8306 41.6970 62.1781 562.7642 51.6583 63.2099 51.6335 72.8183 114.7666 0.5133 5.1013 12.6286 4.0448 14.8683 8.3714 1.7549 4.0182 2.7915 2.6289 17.8122 8.5579 12.4629 15.4787
temp: 298.150 k
press: 1.00000 atm
elementType: 9 9 9 9 8 8 7 7 6 6 6 6 6 6 6 6 6 6 6 6 6 6 6 6 6 6 6 1 1 1 1 1 1 1 1 1 1 1 1
symmnumber: 1
zpe: 709054.5 jmol-1
zpe.correction: 0.270065 hartree
zpe.thermalcorrener: 0.292962 hartree
zpe.thermalcorrenthalpy: 0.293906 hartree
zpe.thermalcorrgfe: 0.212338 hartree
zpe.sumelectzpe: -1388.666632 hartree
zpe.sumelectthermal: -1388.643735 hartree
zpe.sumelectthermalent: -1388.642791 hartree
zpe.sumelectthermalfe: -1388.724358 hartree
dipole: 1.9518 8.0246 2.7368
dipole: 8.7002
quadrupole: -153.9452 -144.8294 -155.9579
quadrupole: 1.2776 6.1299 5.6666
quadrupole: -2.3677 6.7481 -4.3804 1.2776 6.1299 5.6666
hfenergy: -1388.9366964 hartree
pointgroup: C01 [X(C19H12F4N2O2)]
dipole: 0.7260261 -3.1286081 -1.1836898 debye
polarizability: 313.1278945|17.4798278|279.6871799|14.2767724|27.9487789|135.7294771 unknown
InChI: InChI=1S/C19H12F4N2O2/c20-13-6-8-14(9-7-13)25-17(26)16-5-2-10-24-18(16)27-15-4-1-3-12(11-15)19(21,22)23/h1-11,25H
charge 0 multiplicity 1
39 atoms
F  -5.149244 3.485334 0.150668
F  -2.899954 3.710449 0.380073
F  -3.847546 3.777943 -1.676211
F  6.790988 3.08774 0.807665
O  -1.022916 -0.801382 -0.284406
O  1.211658 -0.377734 1.698645
N  2.771611 -0.771019 -0.021785
N  -1.307405 -3.154413 -0.614985
C  0.82632 -2.217099 0.151397
C  -2.351742 -0.364973 -0.51158
C  -3.750114 1.623788 -0.541501
C  -0.542571 -2.103248 -0.249067
C  -2.488924 1.030772 -0.34241
C  1.596606 -1.030387 0.686494
C  3.760424 0.224241 0.233166
C  -3.455029 -1.171818 -0.876311
C  -4.873588 0.840444 -0.903947
C  1.391733 -3.50945 0.130334
C  -4.711374 -0.549474 -1.063527
C  -3.903261 3.112414 -0.414821
C  3.68462 1.124585 1.331037
C  4.859139 0.297427 -0.665844
C  0.606385 -4.623028 -0.25867
C  -0.737961 -4.39762 -0.609195
C  4.70322 2.082193 1.519599
C  5.876808 1.253305 -0.480408
C  5.776056 2.128875 0.614701
H  -1.61715 1.619212 -0.044731
H  -3.3218 -2.245915 -1.0009
H  -5.850854 1.310736 -1.045859
H  2.918548 -1.33861 -0.860538
H  2.431119 -3.650165 0.447152
H  -5.572102 -1.166888 -1.339938
H  2.83599 1.070524 2.014369
H  4.92093 -0.392696 -1.516478
H  1.021203 -5.634107 -0.272606
H  -1.397358 -5.222751 -0.898159
H  4.663483 2.784957 2.356741
H  6.727249 1.322439 -1.164163
