program: Gaussian 09
title: 000158178
version: EM64L-G09RevD.01
frameworkgroup: C1[X(C8H17NO2)]
method: RPBEPBE
basis: SDD
operation: Freq
keyword: #p
keyword: freq=noraman
keyword: PBEPBE/SDD
title: #p freq=noraman PBEPBE/SDD
converged: YES YES NO NO
title: Mulliken charges:
elementType: O O N C C C C C C C C H H H H H H H H H H H H H H H H H
charge: -0.272056 -0.245222 -0.559046 -0.021675 -0.397102 -0.245876 -0.723600 -0.711310 0.219438 -0.228043 -0.672857 0.209606 0.202813 0.226791 0.257403 0.209050 0.235510 0.206363 0.215676 0.212209 0.207062 0.269860 0.277869 0.227669 0.227676 0.212065 0.229671 0.230055
chargesum: 0.00000
title: Mulliken charges with hydrogens summed into heavy atoms:
elementType: O O N C C C C C C C C
charge: -0.272056 -0.245222 -0.011317 0.187931 0.032503 0.011527 -0.072677 -0.076362 0.219438 0.227302 -0.001066
polarizability: 1.10709914e+02 6.24668090e+00 1.04017856e+02 7.84905606e-01 1.39408185e+00 8.93609402e+01
1716.lowfreq: -2.5295 -0.0009 -0.0009 -0.0008 4.8481 10.1533 19.3771 49.3759 56.7919
frequency: 16.6841 49.2315 56.7095 71.7891 136.0376 139.0437 153.2910 215.0401 224.2839 247.7832 250.2862 274.8422 285.5798 308.1808 340.5416 367.3908 407.2962 437.0271 494.5754 643.7994 682.3656 726.9556 796.9925 802.7991 818.3222 838.7701 912.3525 918.9154 938.7505 961.9996 1008.5872 1024.1836 1085.1155 1101.6803 1106.4821 1114.7462 1132.8396 1143.2288 1179.5335 1193.9384 1231.4808 1246.1436 1300.4728 1308.0949 1334.0236 1340.7162 1351.1231 1368.9164 1378.1000 1391.4002 1399.4678 1452.8326 1463.5647 1469.3465 1471.4711 1473.3375 1481.6105 1486.0820 1494.5739 1626.1628 1643.7021 2957.8486 2966.8920 2969.3167 2973.8213 2994.8684 3009.5009 3038.1395 3058.9632 3062.8865 3067.4853 3067.9546 3070.3745 3075.9910 3091.6459 3106.4597 3433.2538 3559.7423
redmass: 3.1496 3.0502 2.6973 3.3280 2.3570 3.6445 2.8105 1.0658 1.5063 1.3740 1.3343 1.9218 3.9877 1.6044 2.6573 2.9043 2.2632 3.0988 2.7085 1.9592 2.0930 6.2093 1.1077 3.4301 2.6763 3.8819 1.3445 1.3532 1.8903 1.5131 2.2985 2.4260 1.4489 3.6889 2.7118 2.3566 1.4780 2.2483 1.7948 1.6693 1.4842 1.1414 1.3325 1.4057 1.3916 1.4589 1.3774 1.2948 1.2444 1.2119 1.2633 1.0848 1.0404 1.0552 1.0478 1.0622 1.0558 1.0671 1.0476 9.3203 1.0901 1.0831 1.0360 1.0412 1.0548 1.0358 1.0582 1.0981 1.0994 1.0945 1.1041 1.0962 1.0992 1.0984 1.0986 1.1026 1.0448 1.0969
irintensity: 0.4085 0.9592 0.3809 0.0443 0.4433 0.9679 3.0017 0.2898 4.3984 15.2811 11.7854 6.0521 10.9743 40.1055 1.5659 8.8816 1.4497 1.8037 6.9783 105.2358 137.4172 33.5893 3.7745 5.2728 1.3024 7.2007 4.9791 17.4662 4.5967 0.4222 6.9367 69.4425 10.3709 239.7519 15.5103 48.5054 6.2089 20.8842 9.8697 2.1069 8.6858 0.1906 2.4672 15.3585 2.5461 3.8445 1.9002 14.1422 7.8331 16.9634 23.8052 4.4982 11.6326 3.8647 8.2525 5.0476 5.9103 13.5743 19.4319 153.3426 40.1867 21.9321 29.4637 35.8522 28.1125 20.9768 18.6266 7.9276 7.5391 15.9625 18.1798 66.6461 60.9927 40.9715 30.9757 45.3458 1.6575 2.1698
temp: 298.150 k
press: 1.00000 atm
elementType: 8 8 7 6 6 6 6 6 6 6 6 1 1 1 1 1 1 1 1 1 1 1 1 1 1 1 1 1
symmnumber: 1
zpe: 638959.8 jmol-1
zpe.correction: 0.243367 hartree
zpe.thermalcorrener: 0.257635 hartree
zpe.thermalcorrenthalpy: 0.258579 hartree
zpe.thermalcorrgfe: 0.201211 hartree
zpe.sumelectzpe: -519.336189 hartree
zpe.sumelectthermal: -519.321921 hartree
zpe.sumelectthermalent: -519.320976 hartree
zpe.sumelectthermalfe: -519.378344 hartree
dipole: -1.5524 -1.2542 -0.6705
dipole: 2.1054
quadrupole: -63.2692 -67.5353 -72.6222
quadrupole: 0.2475 2.4473 -3.0178
quadrupole: 4.5397 0.2736 -4.8133 0.2475 2.4473 -3.0178
hfenergy: -519.5795557 hartree
pointgroup: C01 [X(C8H17N1O2)]
dipole: 0.5787982 -0.5327342 0.2593962 debye
polarizability: 110.0538826|-6.5337803|104.7206643|1.0850258|-0.9769027|89.3141631 unknown
InChI: InChI=1S/C8H17NO2/c1-4-11-8(10)7(9)5-6(2)3/h6-7H,4-5,9H2,1-3H3
charge 0 multiplicity 1
28 atoms
O  1.49111 -0.248761 0.420132
O  1.010703 1.332765 -1.226062
N  -0.630381 2.556936 0.963514
C  -1.843868 -0.933169 -0.269535
C  -1.79842 0.58578 0.041831
C  -0.507984 1.104999 0.728911
C  -1.697411 -1.797594 1.006154
C  -3.160345 -1.26872 -1.010762
C  0.716136 0.767563 -0.145032
C  2.705069 -0.667931 -0.352132
C  3.35209 -1.807474 0.428037
H  -1.0011 -1.178504 -0.9506
H  -1.933091 1.152484 -0.902868
H  -2.639939 0.856794 0.708439
H  -0.379688 0.604125 1.702916
H  -1.812607 -2.871148 0.765737
H  -0.707972 -1.666225 1.479447
H  -2.476307 -1.533038 1.747781
H  -3.264062 -0.671684 -1.936112
H  -3.200028 -2.338419 -1.288106
H  -4.036313 -1.05358 -0.368597
H  0.098942 2.941138 1.57491
H  -0.701471 3.088767 0.087136
H  2.383763 -0.972686 -1.36456
H  3.368723 0.209922 -0.453268
H  4.256658 -2.158229 -0.101632
H  3.647684 -1.476741 1.438379
H  2.657507 -2.658872 0.530041
