program: Gaussian 09
title: 000158169
version: EM64L-G09RevD.01
frameworkgroup: C1[X(C19H25N3O3)]
method: RPBEPBE
basis: SDD
operation: Freq
keyword: #p
keyword: freq=noraman
keyword: PBEPBE/SDD
title: #p freq=noraman PBEPBE/SDD
converged: YES YES NO NO
title: Mulliken charges:
elementType: O O O N N N C C C C C C C C C C C C C C C C C C C H H H H H H H H H H H H H H H H H H H H H H H H H
charge: -0.319428 -0.235473 -0.240653 -0.071857 -0.159100 -0.395615 0.279661 -0.373544 -0.372268 -0.769112 0.045301 -0.718986 -0.719092 -0.253294 -0.282302 0.159734 0.151476 -0.021171 0.295839 0.248309 -0.381425 -0.388210 -0.220035 -0.528897 -0.536358 0.186937 0.199164 0.199009 0.188091 0.233815 0.191474 0.235066 0.229677 0.225695 0.210796 0.230056 0.210917 0.225103 0.236759 0.308766 0.371222 0.244942 0.245493 0.226694 0.229034 0.224928 0.256882 0.224175 0.253115 0.218688
chargesum: 0.00000
title: Mulliken charges with hydrogens summed into heavy atoms:
elementType: O O O N N N C C C C C C C C C C C C C C C C C C C
charge: -0.319428 -0.235473 -0.240653 -0.071857 -0.159100 -0.024393 0.279661 0.012557 0.014832 -0.108757 0.045301 -0.052819 -0.053015 -0.016535 0.026464 0.159734 0.151476 -0.021171 0.295839 0.248309 -0.136483 -0.142717 0.006658 0.181947 0.159620
polarizability: 3.71158295e+02 -5.16214455e+00 2.45081366e+02 -3.96902442e+00 -1.56590908e+01 1.59873175e+02
1716.lowfreq: -3.3678 -0.0010 -0.0009 -0.0009 1.7079 4.6223 18.1884 19.8652 35.5522
frequency: 16.1580 19.7510 35.5258 46.6266 49.2678 64.1568 80.1010 88.0927 97.9646 107.5958 122.8658 135.0565 156.8338 174.8097 184.6387 190.3472 211.0989 221.2951 223.6533 231.7125 239.9705 271.4345 277.8343 290.7862 301.2305 323.7524 330.7246 352.3594 356.3432 361.3702 381.4017 402.2641 404.6988 459.3553 478.8404 500.1100 501.9588 525.5014 577.9574 579.6813 602.3425 607.0193 634.0934 670.6780 684.7682 719.0863 738.5640 751.6111 767.4759 774.5118 786.2080 798.5852 825.7993 841.1331 846.3508 855.5785 861.4861 879.0918 883.2007 953.9830 968.8990 985.8404 987.3418 999.2768 1005.6140 1012.6583 1040.0990 1042.3690 1071.6998 1077.7285 1081.1183 1094.0136 1108.0464 1113.3453 1115.8365 1135.5844 1148.6148 1151.2798 1157.3343 1165.9787 1188.1351 1196.3556 1210.3868 1230.3372 1242.2292 1254.1003 1254.9164 1262.0876 1310.0671 1317.1145 1335.0029 1357.6677 1363.3324 1376.1761 1390.1114 1392.8109 1397.0332 1423.0434 1435.9255 1448.4732 1453.4842 1456.2513 1465.0478 1467.3125 1469.3325 1470.0861 1472.6413 1474.9688 1477.2825 1477.8750 1485.9799 1487.1500 1497.3399 1499.4807 1538.9429 1571.4968 1580.2486 1592.4290 1610.0801 2960.7162 2962.3921 2966.4683 2972.2801 2983.8865 2984.9035 2989.1588 3011.2626 3018.3651 3053.1999 3066.3948 3072.3528 3073.3113 3084.7133 3086.4011 3089.6156 3108.6755 3131.4083 3133.8342 3140.5361 3144.5702 3172.9960 3181.9883 3194.8375 3447.4328
redmass: 3.6499 4.7177 5.3609 4.6128 4.4834 3.0851 2.6280 2.3565 4.4637 4.4650 2.8030 2.7033 4.1043 2.8108 1.8159 2.6210 1.1474 2.6658 3.9608 1.4354 1.1780 1.5401 2.2885 2.2087 3.3150 2.2880 4.1821 3.3095 4.6413 3.7546 3.8431 5.7131 5.0271 3.7609 4.4184 4.0059 3.4556 4.5290 3.7412 3.0824 4.6707 4.9304 8.1150 4.7885 3.6792 3.1448 1.9153 1.7342 1.3520 1.3911 3.1040 4.3102 6.4359 1.4525 1.8588 1.7395 6.1920 5.3213 1.9101 1.3108 1.7129 7.6908 4.5367 1.3486 1.8484 1.4408 1.6187 4.5468 1.5519 5.4506 2.9262 2.2197 1.2588 1.3956 1.5849 1.9817 1.3568 2.1716 3.4441 1.6429 2.7594 1.1696 2.5523 2.2235 2.1912 1.8604 1.3257 5.1091 1.4708 1.6375 1.4419 3.7197 3.0830 10.2257 1.2446 1.2070 1.2001 1.3967 1.3601 1.8238 1.0610 1.7624 1.0632 1.0608 1.0667 1.0585 1.0684 1.0539 1.1806 1.0436 1.0633 1.0629 1.0965 2.1934 3.8891 6.3439 5.9239 6.4537 6.1721 1.0595 1.0331 1.0590 1.0323 1.0366 1.0364 1.0405 1.1008 1.0999 1.1040 1.1046 1.0991 1.0989 1.0998 1.0993 1.0954 1.0979 1.0994 1.1005 1.0879 1.0914 1.0911 1.0971 1.0966 1.0763
irintensity: 0.4228 1.0038 1.7540 1.4098 2.4175 7.3574 5.4644 0.0061 2.9844 1.3174 5.6430 3.8826 0.2051 0.3531 0.1654 2.3972 0.1803 3.9112 8.3917 0.3259 0.9301 0.0342 2.9783 1.9071 11.5138 0.2012 4.2750 0.2641 0.5901 1.2372 1.2890 1.4301 0.2792 2.2588 3.7570 9.9404 2.2173 3.6327 3.0697 7.2023 5.9928 15.8858 0.3442 5.0327 4.1659 27.7408 62.5067 6.4228 3.2061 23.7207 1.5760 63.9977 24.9470 0.6220 2.1456 19.2677 5.0243 37.5286 19.5730 0.5308 2.8377 26.7041 8.3098 2.8568 11.8882 26.6519 7.3405 37.0553 0.0663 254.1093 2.8114 14.4622 0.1522 1.4262 2.1561 27.2838 4.3727 5.8009 22.2136 2.0890 7.0604 7.1638 109.9692 7.5329 176.7719 10.9038 4.0681 13.6450 0.5054 20.2529 12.8766 206.6739 1.9226 15.6391 7.7363 27.9627 18.8214 69.7171 6.8088 23.6876 1.4274 122.8689 3.7497 2.0267 8.1156 24.7728 16.5953 2.9305 0.7398 0.7457 15.4638 13.1841 81.1328 970.3129 8.9309 89.9800 96.6619 42.7907 266.3899 4.8889 78.5047 78.9008 57.9665 40.6117 16.3491 38.7021 0.0688 70.9274 42.9735 36.3963 37.0625 59.3402 13.7691 101.5947 29.3626 22.5375 17.1643 13.8228 6.2861 15.2297 11.2820 14.0289 5.3095 83.3698
temp: 298.150 k
press: 1.00000 atm
elementType: 8 8 8 7 7 7 6 6 6 6 6 6 6 6 6 6 6 6 6 6 6 6 6 6 6 1 1 1 1 1 1 1 1 1 1 1 1 1 1 1 1 1 1 1 1 1 1 1 1 1
symmnumber: 1
zpe: 1072355.3 jmol-1
zpe.correction: 0.408439 hartree
zpe.thermalcorrener: 0.434516 hartree
zpe.thermalcorrenthalpy: 0.435460 hartree
zpe.thermalcorrgfe: 0.350730 hartree
zpe.sumelectzpe: -1127.028583 hartree
zpe.sumelectthermal: -1127.002506 hartree
zpe.sumelectthermalent: -1127.001561 hartree
zpe.sumelectthermalfe: -1127.086291 hartree
dipole: 4.0794 0.1659 0.0193
dipole: 4.0828
quadrupole: -108.9868 -130.1371 -156.4400
quadrupole: 8.6300 -10.4332 2.4275
quadrupole: 22.8678 1.7176 -24.5854 8.6300 -10.4332 2.4275
hfenergy: -1127.4370213 hartree
pointgroup: C01 [X(C19H25N3O3)]
dipole: -1.6033895 -0.0564725 0.0787089 debye
polarizability: 368.7701686|18.8715266|223.2073788|-11.7602236|40.3134806|184.1352878 unknown
InChI: InChI=1S/C19H25N3O3/c1-6-19(3,7-2)15-11-12-16(22-21-15)20-18(23)17-13(24-4)9-8-10-14(17)25-5/h8-12,20H,6-7H2,1-5H3
charge 0 multiplicity 1
50 atoms
O  -2.377955 1.817325 1.180241
O  -3.497925 -2.438864 -0.724104
O  -1.351105 -0.927442 -1.561665
N  2.920399 0.693739 1.087077
N  1.555481 0.63042 1.161971
N  -0.540026 0.014787 0.418208
C  5.115083 0.237899 -0.001908
C  5.74355 -1.199801 -0.081639
C  5.552881 1.004241 -1.302686
C  5.648806 0.977234 1.249245
C  3.582462 0.124634 0.023957
C  5.408987 -2.145261 1.09145
C  5.009852 2.441051 -1.451816
C  2.861895 -0.535738 -1.013186
C  1.466093 -0.612219 -0.957359
C  0.839909 -0.006153 0.169335
C  -1.571825 -0.426142 -0.419381
C  -2.96719 -0.269204 0.145382
C  -3.386909 0.886166 0.873726
C  -3.954733 -1.273115 -0.117149
C  -4.734023 1.077455 1.263224
C  -5.307801 -1.088686 0.26916
C  -5.683442 0.087964 0.943678
C  -2.748377 3.068415 1.849475
C  -4.474837 -3.476542 -1.0646
H  5.428056 -1.677519 -1.032015
H  6.843284 -1.075052 -0.152641
H  6.661619 1.025465 -1.316298
H  5.246743 0.409293 -2.187833
H  5.363932 0.458372 2.178653
H  6.7527 1.040905 1.196662
H  5.233768 1.994787 1.325518
H  4.317812 -2.280723 1.203235
H  5.799942 -1.762173 2.050278
H  5.856562 -3.142315 0.923463
H  3.90508 2.460091 -1.429431
H  5.334955 2.877539 -2.41431
H  5.373688 3.102493 -0.646051
H  3.397516 -0.981863 -1.856919
H  0.858981 -1.094558 -1.724579
H  -0.801578 0.562993 1.248376
H  -5.041315 1.974285 1.805966
H  -6.05769 -1.854075 0.056345
H  -6.728993 0.230617 1.237441
H  -3.465234 3.646138 1.236876
H  -3.17487 2.87557 2.852008
H  -1.804782 3.624203 1.946919
H  -5.241188 -3.092597 -1.764699
H  -3.884176 -4.262858 -1.555822
H  -4.964064 -3.885481 -0.158979
