program: Gaussian 09
title: 000158160
version: EM64L-G09RevD.01
frameworkgroup: C1[X(C18H24O3)]
method: RPBEPBE
basis: SDD
operation: Freq
keyword: #pfreq=noraman
keyword: PBEPBE/SDD
title: #p freq=noraman PBEPBE/SDD
converged: YES YES NO NO
title: Mulliken charges:
elementType: O O O C C C C C C C C C C C C C C C C C C H H H H H H H H H H H H H H H H H H H H H H H H
charge: -0.273777 -0.277603 -0.265247 0.312184 -0.270645 -0.383243 -0.748432 -0.736203 -0.261082 0.259637 0.357913 -0.791737 -0.794057 -0.437236 0.483477 -0.356770 -0.395834 -0.353635 -0.351287 0.325301 -0.538492 0.257300 0.265031 0.263795 0.211430 0.206574 0.219943 0.212930 0.221357 0.195055 0.216363 0.217832 0.227607 0.220305 0.219593 0.236549 0.231038 0.226189 0.236083 0.231037 0.250846 0.240284 0.221382 0.246014 0.222228
chargesum: 0.00000
title: Mulliken charges with hydrogens summed into heavy atoms:
elementType: O O O C C C C C C C C C C C C C C C C C C
charge: -0.273777 -0.277603 -0.265247 0.312184 -0.013345 -0.118212 -0.066633 -0.081972 -0.066027 0.259637 0.357913 -0.129935 -0.117611 0.019991 0.483477 -0.120687 -0.164797 -0.102789 -0.111003 0.325301 0.151133
polarizability: 2.98636783e+02 1.62251699e+01 2.02578356e+02 2.36409901e+01 4.26556854e+00 1.61426155e+02
1716.lowfreq: -8.3644 -1.4537 -0.0007 -0.0004 0.0004 5.3775 9.2389 15.5744 19.8265
frequency: -4.4380 15.2939 19.5670 30.5661 42.4973 76.9461 79.2224 98.8541 108.5152 129.4053 135.2531 154.7253 166.2238 172.2949 190.9740 208.4545 221.9427 230.8169 240.5635 262.5565 282.6096 287.2208 323.0191 336.1841 353.7731 373.5422 413.7535 415.9940 424.9398 439.8331 460.9807 498.9746 511.2347 514.2897 545.0516 626.8333 632.7822 680.0842 717.4028 728.1496 756.5592 801.0272 813.2308 818.8859 827.3819 836.8321 862.5314 869.2086 890.1207 942.5397 944.8139 949.1507 951.5641 964.1790 965.4642 980.5526 988.6790 991.7187 1003.9168 1013.1040 1036.8215 1053.5608 1074.7413 1081.2354 1112.9094 1113.3332 1115.8301 1127.1216 1156.1206 1164.6901 1179.2147 1188.3752 1196.5714 1226.0608 1237.8675 1242.9074 1286.5985 1305.1501 1322.9748 1342.4773 1370.8287 1385.3966 1387.5094 1390.2426 1400.1529 1401.8079 1419.0448 1419.8324 1437.6261 1453.6967 1464.2198 1466.2731 1467.3644 1470.2345 1471.1623 1471.7054 1473.0286 1475.8209 1484.9382 1490.9109 1507.5288 1586.0668 1609.4500 1626.3456 1685.6722 2955.7713 2959.7749 2965.0639 2973.4013 2978.0186 3013.6696 3025.9502 3031.6408 3047.9000 3056.7516 3065.5399 3076.5406 3077.7600 3082.1274 3089.7767 3096.9060 3098.0853 3119.2828 3125.2928 3127.3077 3131.9484 3150.2516 3162.8461 3168.9247
redmass: 4.1142 3.3998 3.3240 4.5975 3.8130 3.2900 4.1986 1.3328 2.1637 3.9862 3.1481 1.6438 1.8226 2.4917 1.3664 2.2016 2.5221 1.4288 1.4590 3.3186 3.9586 2.7447 2.4344 2.9207 3.4025 2.6900 2.9192 2.5296 3.6215 3.7102 2.8810 2.8912 3.1898 3.8115 2.9647 4.1864 6.6317 6.1813 3.7803 5.0436 5.1114 3.0414 1.6763 3.3511 1.6828 4.7409 1.5807 3.5542 3.3286 1.4749 1.8159 1.4234 1.6155 1.3674 1.7351 1.5571 7.8460 1.2538 2.6206 1.5923 1.6773 1.7371 1.3927 1.5747 1.3228 1.7538 1.4586 1.8308 1.3354 2.5244 1.2281 1.0927 2.0680 2.0446 4.1464 2.4383 1.7610 1.2927 1.6802 1.5794 1.6829 5.3138 1.2269 1.2892 1.2498 1.2651 2.3761 3.2284 1.1710 1.0497 1.0520 1.0536 1.0513 1.0967 1.0487 1.0509 1.0692 1.0840 1.1378 1.0624 2.6559 7.0956 9.6779 6.4880 6.3447 1.0373 1.0331 1.0392 1.0369 1.0363 1.0580 1.0968 1.0963 1.1040 1.0989 1.0989 1.0979 1.1074 1.0964 1.0903 1.0984 1.0959 1.0876 1.0974 1.0913 1.0896 1.0890 1.0941 1.0957
irintensity: 0.1486 0.8272 0.3620 0.2877 0.9900 1.6432 1.0520 0.7324 1.9809 2.0686 0.0746 2.6061 0.9214 2.1547 0.6033 6.9472 1.1710 0.1266 4.3928 3.5532 7.2900 0.8682 1.4422 0.9235 3.0976 1.8449 0.1311 0.7285 0.3112 13.6549 0.6604 19.4627 12.3018 10.8683 23.2825 4.3858 0.6311 11.2851 4.5018 7.4430 7.4993 100.7798 12.8320 0.3244 27.3571 74.3835 17.8337 2.9369 47.9629 1.7566 33.3160 1.6945 7.7791 0.3376 29.9406 78.2320 36.7850 2.8780 4.9628 21.3074 35.3049 63.1899 7.8377 4.9359 67.1455 389.2677 155.4444 5.5332 0.3998 78.7527 45.6062 5.2893 64.2384 51.3787 168.0596 29.8380 57.6292 0.6176 29.4970 36.6063 58.5191 6.9396 7.8847 44.2493 17.3889 17.8089 62.8674 7.4250 7.7391 1.9775 21.3899 1.7493 14.3619 4.7180 19.3107 11.0829 49.3124 2.5072 16.1314 13.2316 93.7274 9.9819 174.7102 79.4781 5.9379 50.7029 69.0790 63.2102 31.5090 50.9799 21.0208 13.5754 39.8914 48.6207 17.8066 47.9499 21.3439 12.5350 24.8431 34.0170 7.3751 28.8511 12.4035 35.7814 3.1828 13.2912 4.2104 15.3229 4.6498
temp: 298.150 k
press: 1.00000 atm
elementType: 8 8 8 6 6 6 6 6 6 6 6 6 6 6 6 6 6 6 6 6 6 1 1 1 1 1 1 1 1 1 1 1 1 1 1 1 1 1 1 1 1 1 1 1 1
symmnumber: 1
zpe: 982641.0 jmol-1
zpe.correction: 0.374268 hartree
zpe.thermalcorrener: 0.396815 hartree
zpe.thermalcorrenthalpy: 0.397759 hartree
zpe.thermalcorrgfe: 0.320370 hartree
zpe.sumelectzpe: -924.350487 hartree
zpe.sumelectthermal: -924.327940 hartree
zpe.sumelectthermalent: -924.326996 hartree
zpe.sumelectthermalfe: -924.404385 hartree
dipole: 1.1133 0.7786 1.9400
dipole: 2.3684
quadrupole: -99.9075 -120.4293 -128.5925
quadrupole: 13.2342 2.0725 5.4083
quadrupole: 16.4022 -4.1195 -12.2827 13.2342 2.0725 5.4083
hfenergy: -924.7247548 hartree
pointgroup: C01 [X(C18H24O3)]
dipole: -0.4690164 0.7571814 -0.2737676 debye
polarizability: 301.0774572|-22.8296575|179.5851165|6.9416412|20.0942025|181.9787202 unknown
InChI: InChI=1S/C18H24O3/c1-12(2)10-15-16(18(15,3)4)17(19)21-11-13-6-8-14(20-5)9-7-13/h6-10,15-16H,11H2,1-5H3
charge 0 multiplicity 1
45 atoms
O  -0.212987 -0.057194 0.506062
O  1.301355 -0.641491 2.187921
O  -6.233515 -0.201453 -1.552087
C  2.933674 1.881209 1.064835
C  3.499742 0.587983 0.453747
C  1.959634 0.876474 0.371831
C  2.93293 2.005092 2.587236
C  3.135375 3.212587 0.341414
C  4.315731 0.54262 -0.786682
C  1.041209 -0.002738 1.132999
C  5.297803 -0.359698 -1.087705
C  6.05406 -0.27129 -2.403318
C  5.729577 -1.503244 -0.18673
C  -1.230551 -0.952229 1.175131
C  -2.551266 -0.741809 0.486072
C  -2.905314 -1.502053 -0.661099
C  -3.469737 0.224076 0.959459
C  -4.132001 -1.300709 -1.316324
C  -4.708195 0.442915 0.316451
C  -5.038219 -0.324243 -0.828979
C  -7.203217 0.796019 -1.093556
H  3.727778 -0.176209 1.205874
H  1.5660 1.193922 -0.59787
H  2.73218 1.037617 3.076059
H  3.915368 2.37851 2.932977
H  2.160472 2.724405 2.92068
H  4.133683 3.6282 0.575745
H  3.057614 3.11923 -0.755494
H  2.374589 3.944937 0.669807
H  4.099289 1.320007 -1.534632
H  7.142359 -0.149331 -2.230213
H  5.93153 -1.201016 -2.994546
H  5.709993 0.575524 -3.02234
H  5.629379 -2.471459 -0.716477
H  6.799591 -1.402946 0.084553
H  5.148614 -1.569653 0.746618
H  -1.258609 -0.687114 2.246468
H  -0.863993 -1.990348 1.084259
H  -2.208073 -2.255651 -1.045988
H  -3.214769 0.820936 1.84356
H  -4.412869 -1.881642 -2.199889
H  -5.395316 1.197343 0.710843
H  -7.556408 0.573201 -0.067771
H  -8.044151 0.723892 -1.798633
H  -6.775939 1.817221 -1.125369
