program: Gaussian 09
title: 000158158
version: EM64L-G09RevD.01
frameworkgroup: C1[X(C17H21ClO2)]
method: RPBEPBE
basis: SDD
operation: Freq
keyword: #p
keyword: freq=noraman
keyword: PBEPBE/SDD
title: #p freq=noraman PBEPBE/SDD
converged: YES YES NO NO
title: Mulliken charges:
elementType: Cl O O C C C C C C C C C C C C C C C C C H H H H H H H H H H H H H H H H H H H H H
charge: -0.057201 -0.276506 -0.274145 0.311216 -0.269768 -0.391709 -0.748624 -0.736059 -0.263969 0.268520 0.360228 -0.791216 -0.794320 -0.427560 0.501500 -0.352340 -0.412408 -0.211273 -0.207912 -0.098440 0.259288 0.266950 0.263180 0.213146 0.207029 0.221509 0.213637 0.221941 0.197572 0.217489 0.218363 0.228055 0.221470 0.220524 0.236518 0.239749 0.228589 0.244194 0.239839 0.255908 0.257035
chargesum: 0.00000
title: Mulliken charges with hydrogens summed into heavy atoms:
elementType: Cl O O C C C C C C C C C C C C C C C C C
charge: -0.057201 -0.276506 -0.274145 0.311216 -0.010480 -0.124759 -0.065268 -0.078972 -0.066397 0.268520 0.360228 -0.127309 -0.115808 0.040778 0.501500 -0.108146 -0.172568 0.044635 0.049122 -0.098440
polarizability: 2.87986103e+02 8.93802314e+00 1.93438149e+02 2.03885241e+01 1.20437108e+01 1.56027951e+02
1716.lowfreq: -11.1441 -11.1336 -6.2028 -0.0015 -0.0011 0.0004 3.6199 8.3017 20.4571
frequency: -11.1198 2.7176 20.3473 28.9126 40.5484 77.3321 87.0257 109.1375 120.3433 132.5599 147.1565 164.4005 184.9076 188.9368 206.9377 225.5802 236.7695 256.1885 271.8722 284.5583 331.6977 336.3598 349.0318 367.9763 395.9523 407.8231 415.5813 425.6469 458.0208 500.6966 508.9891 524.8690 617.3722 626.1003 627.3970 700.6859 722.4939 728.1160 799.5227 813.1439 820.7884 829.0068 836.9966 858.6275 875.5452 885.4659 942.9280 948.5011 951.4687 963.2288 965.0499 973.0925 979.0945 990.5337 1002.0360 1012.3252 1036.9708 1053.4432 1071.3608 1076.5863 1082.3087 1111.2268 1111.8622 1125.7142 1166.3623 1184.2901 1191.3874 1196.9297 1226.5793 1242.7146 1286.1179 1296.4260 1323.2894 1343.9450 1369.7253 1382.0796 1386.7313 1389.8433 1396.2421 1399.0866 1400.7880 1418.6529 1455.0708 1462.2736 1466.9597 1471.5919 1472.0948 1473.5722 1476.3623 1481.2847 1483.2408 1489.8550 1589.6358 1604.8618 1613.7692 1684.9870 2956.8908 2965.5706 2973.5946 2977.8142 3010.5737 3027.5752 3032.8028 3057.2074 3065.7988 3072.1312 3078.6054 3081.6741 3093.2607 3096.9096 3097.5135 3122.9215 3135.5085 3141.2053 3152.9985 3171.0093 3174.5068
redmass: 3.8932 5.0045 3.2384 7.0023 3.8758 4.1246 3.9964 1.3891 2.3608 2.8630 3.5531 1.9284 1.4987 1.1774 3.4175 2.1552 2.0970 3.8620 3.9619 3.4209 3.7709 2.8929 2.8829 2.7170 5.8738 2.9013 2.4752 3.4228 2.5309 2.9085 3.1277 3.3572 5.6726 6.9153 4.5095 4.5886 4.7420 5.6645 2.5684 2.9190 2.6365 1.2486 3.4888 1.6375 4.1777 3.3591 1.5445 1.4576 1.5400 1.6752 1.3773 1.6683 1.6456 1.2525 3.9315 1.6334 1.7768 1.7021 2.7575 1.4354 1.5163 1.4528 1.9330 1.8288 2.6313 1.1215 1.1063 2.0795 2.3983 2.4308 1.7482 1.2739 1.6489 1.6465 1.8373 5.3223 1.2373 1.2900 2.5728 1.2434 1.2568 2.2094 1.0497 1.0537 1.0525 1.0526 1.0463 1.1214 1.0835 2.4214 1.1282 1.0748 7.4398 6.3351 9.7223 6.3329 1.0374 1.0390 1.0369 1.0364 1.0575 1.0969 1.0963 1.0989 1.0989 1.1071 1.0981 1.0981 1.0889 1.0983 1.0963 1.0876 1.0901 1.0897 1.0890 1.0956 1.0963
irintensity: 0.2523 0.2768 0.2852 0.2767 1.6301 1.2745 0.9091 0.3985 0.1671 0.0552 0.1115 1.4018 2.6361 0.6646 3.7799 0.2984 3.3366 0.6564 7.1064 3.0488 1.9348 2.2424 3.4919 2.1697 19.3245 0.3249 3.1824 14.3826 2.7969 13.9239 4.6900 18.6411 9.8463 0.1437 0.1137 1.0209 3.3194 5.8900 65.8398 23.9920 9.9312 0.0636 86.0462 17.5103 13.7776 48.7747 14.2099 7.3345 12.7583 17.3494 0.1332 1.4815 91.5480 1.8304 43.6478 22.6855 45.3639 53.1524 58.3086 4.4686 6.3231 118.6981 397.9412 2.8278 59.6109 0.1864 2.6803 61.7366 3.8645 45.2516 62.1148 0.3549 25.3308 20.7937 70.6962 1.8080 11.5613 44.1968 9.1997 10.7444 16.8203 68.8606 1.1926 14.6337 7.4320 11.9800 22.7747 13.4630 2.4374 65.4846 18.0691 7.9734 1.7682 12.5370 177.3418 8.0900 47.7860 61.5365 28.8469 49.8735 19.9071 12.2198 39.5817 16.8522 46.5765 14.0318 21.7719 29.5312 26.8116 7.9756 30.7592 11.3387 9.3584 7.8933 3.8779 6.4167 0.7089
temp: 298.150 k
press: 1.00000 atm
elementType: 17 8 8 6 6 6 6 6 6 6 6 6 6 6 6 6 6 6 6 6 1 1 1 1 1 1 1 1 1 1 1 1 1 1 1 1 1 1 1 1 1
symmnumber: 1
zpe: 874833.2 jmol-1
zpe.correction: 0.333206 hartree
zpe.thermalcorrener: 0.354381 hartree
zpe.thermalcorrenthalpy: 0.355325 hartree
zpe.thermalcorrgfe: 0.278913 hartree
zpe.sumelectzpe: -1269.388528 hartree
zpe.sumelectthermal: -1269.367354 hartree
zpe.sumelectthermalent: -1269.366409 hartree
zpe.sumelectthermalfe: -1269.442821 hartree
dipole: -2.1883 -0.2635 0.6160
dipole: 2.2886
quadrupole: -131.2637 -116.9294 -129.6252
quadrupole: 3.3563 -8.0620 6.3221
quadrupole: -5.3242 9.0100 -3.6858 3.3563 -8.0620 6.3221
hfenergy: -1269.7217341 hartree
pointgroup: C01 [X(C17H21Cl1O2)]
dipole: 0.8689619 0.1947779 -0.1330286 debye
polarizability: 288.093577|-13.8908397|180.7423879|19.3764471|19.3175695|168.6162389 unknown
InChI: InChI=1S/C17H21ClO2/c1-11(2)9-14-15(17(14,3)4)16(19)20-10-12-5-7-13(18)8-6-12/h5-9,14-15H,10H2,1-4H3
charge 0 multiplicity 1
41 atoms
Cl -6.923907 -0.049318 -2.052405
O  -0.554393 -0.220961 0.226517
O  0.843454 -0.850757 1.99103
C  2.461873 1.792526 1.171901
C  3.118624 0.566962 0.517762
C  1.576063 0.81212 0.33761
C  2.344078 1.808137 2.694681
C  2.666155 3.178859 0.560098
C  4.02731 0.639718 -0.654438
C  0.643776 -0.15169 0.962755
C  5.012237 -0.250538 -0.981601
C  5.876041 -0.030262 -2.212712
C  5.345865 -1.503266 -0.191243
C  -1.569217 -1.197917 0.746266
C  -2.877822 -0.913614 0.052088
C  -3.60401 0.270004 0.342237
C  -3.408455 -1.82581 -0.891948
C  -4.832897 0.5430 -0.295058
C  -4.64045 -1.574199 -1.537889
C  -5.332481 -0.389274 -1.22681
H  3.314745 -0.244815 1.227681
H  1.243679 1.184462 -0.635217
H  2.149177 0.802456 3.101812
H  3.282945 2.191266 3.137247
H  1.521168 2.474105 3.017802
H  3.633634 3.603447 0.888547
H  2.659777 3.165811 -0.543429
H  1.863314 3.863392 0.891118
H  3.88685 1.503689 -1.320354
H  6.947823 0.043265 -1.938984
H  5.789027 -0.881947 -2.917028
H  5.597809 0.890782 -2.753785
H  5.258365 -2.400519 -0.835672
H  6.395428 -1.472388 0.163437
H  4.696069 -1.655677 0.684934
H  -1.627858 -1.072047 1.84263
H  -1.201949 -2.218249 0.536734
H  -3.203233 0.988968 1.065549
H  -2.85799 -2.742657 -1.132569
H  -5.391961 1.456154 -0.071808
H  -5.048462 -2.281219 -2.265588
