program: Gaussian 09
title: 000158157
version: EM64L-G09RevD.01
frameworkgroup: C1[X(C17H21FO2)]
method: RPBEPBE
basis: SDD
operation: Freq
keyword: #p
keyword: freq=noraman
keyword: PBEPBE/SDD
title: #p freq=noraman PBEPBE/SDD
converged: YES YES NO NO
title: Mulliken charges:
elementType: F O O C C C C C C C C C C C C C C C C C H H H H H H H H H H H H H H H H H H H H H
charge: -0.205478 -0.276413 -0.274862 0.312280 -0.270300 -0.389757 -0.748255 -0.735737 -0.263324 0.266986 0.359729 -0.791186 -0.793981 -0.431425 0.494646 -0.334959 -0.380568 -0.361622 -0.363314 0.321217 0.258689 0.266725 0.262952 0.213041 0.206989 0.221336 0.213457 0.221890 0.196797 0.217559 0.218123 0.228012 0.221549 0.220176 0.236221 0.239406 0.226667 0.243344 0.239956 0.256254 0.257176
chargesum: 0.00000
title: Mulliken charges with hydrogens summed into heavy atoms:
elementType: F O O C C C C C C C C C C C C C C C C C
charge: -0.205478 -0.276413 -0.274862 0.312280 -0.011611 -0.123031 -0.065273 -0.079054 -0.066527 0.266986 0.359729 -0.127493 -0.116035 0.034649 0.494646 -0.091615 -0.140611 -0.105368 -0.106138 0.321217
polarizability: 2.63183371e+02 1.17309250e+01 1.91581154e+02 1.56880991e+01 8.50613009e+00 1.48528550e+02
1716.lowfreq: -12.7292 -7.0143 -4.7414 -0.0005 -0.0002 0.0001 2.3098 12.8293 16.9614
frequency: -11.0588 11.9682 16.5250 33.3771 40.0852 77.6656 93.6524 121.1698 127.8262 134.1779 158.8938 170.0604 186.3876 191.1383 214.6761 233.8390 256.0793 271.7015 285.1220 299.8841 336.1012 351.1635 371.5864 393.8382 411.4447 414.5059 431.1517 459.5650 473.1965 501.7918 509.3041 538.1032 623.6421 629.1141 682.3710 711.1241 726.7643 767.6718 804.3228 818.0879 819.6184 823.3477 842.8070 859.9826 873.7276 885.2019 939.2328 947.4761 950.4745 958.3059 961.7914 971.0525 979.6363 991.1024 1006.8953 1011.9207 1036.7414 1053.0688 1075.9918 1082.2642 1107.2131 1111.7210 1125.4306 1155.9732 1165.4592 1194.1361 1197.1467 1198.2405 1229.8656 1242.5722 1286.0336 1295.3853 1323.0708 1344.7565 1369.9310 1386.1982 1388.9316 1389.6523 1398.5173 1400.2640 1407.0224 1418.7131 1455.2136 1462.4548 1466.6952 1471.6755 1472.1802 1475.3477 1476.2663 1483.6625 1490.1252 1499.1188 1604.6096 1613.3274 1615.8380 1685.0683 2956.6115 2965.2536 2973.4551 2977.8064 3012.4262 3027.5749 3032.6213 3056.9197 3066.0346 3074.3775 3077.7514 3080.8703 3090.7675 3096.6789 3097.6742 3119.9153 3138.5587 3143.1409 3152.8123 3175.7299 3178.4491
redmass: 5.1015 3.1325 3.7074 6.1476 4.1915 4.1456 3.9911 2.2895 1.3065 3.0575 2.8394 1.9692 1.5106 1.2745 2.6363 1.6435 3.6521 3.2747 3.7136 3.0277 2.9304 3.6199 2.6776 4.0882 2.9217 2.4793 3.2821 2.7270 5.5032 2.8986 3.2518 3.1342 4.1979 6.8979 6.7040 3.8487 5.2138 4.7728 3.5185 1.2477 3.5075 2.0628 4.1842 1.6273 4.0552 3.2601 1.4707 1.6179 1.5209 1.3641 1.6101 1.7103 1.6142 1.2519 2.6525 1.6231 1.7761 1.7153 1.4132 1.5264 1.2928 2.1888 1.8242 1.4841 2.5679 1.1533 1.9789 1.8447 2.9523 2.4159 1.7572 1.2811 1.6593 1.5992 1.7381 1.2408 6.2397 1.2951 1.2359 1.2603 2.9108 2.2262 1.0496 1.0531 1.0518 1.0490 1.0496 1.0963 1.0839 1.1373 1.0658 2.7933 7.6232 9.4354 6.6951 6.3360 1.0374 1.0390 1.0368 1.0363 1.0576 1.0970 1.0963 1.0988 1.0989 1.1074 1.0980 1.0978 1.0894 1.0984 1.0960 1.0876 1.0903 1.0900 1.0891 1.0956 1.0964
irintensity: 0.3942 0.1962 0.1533 0.4606 1.7347 1.2333 0.6338 0.5410 0.2626 0.0781 0.7454 1.1430 2.7184 0.5859 4.1979 3.4379 1.3219 4.9374 5.0584 1.4527 1.1590 2.7087 1.0901 3.6266 1.1423 1.3360 2.8278 1.4772 37.4433 4.2900 6.4557 20.3601 4.6159 0.0495 13.8036 1.2892 9.1836 2.1472 61.5540 0.1313 9.9006 45.8045 67.9999 16.1314 5.5190 52.5454 8.1348 17.3545 10.6354 0.1064 11.1452 5.5965 83.8012 2.1187 13.9024 21.2804 41.7514 55.1083 5.5968 6.6950 19.2839 522.4502 3.0146 30.6386 51.8562 6.4787 30.0345 61.5550 23.5756 44.6018 59.9268 1.4328 23.0812 25.5635 65.5919 14.1085 0.1121 41.9361 11.3267 18.6469 2.5191 66.6802 1.5777 15.5878 7.3177 17.4394 15.2072 8.4071 2.5601 18.9788 12.9781 87.4942 6.4175 139.1640 58.6083 7.6239 47.0325 62.5811 30.4520 47.7978 21.3501 10.1749 41.7254 18.7804 44.6779 13.0214 20.0887 29.0152 30.2579 7.4849 29.2890 12.2647 9.6282 8.8262 3.9043 4.5034 2.2387
temp: 298.150 k
press: 1.00000 atm
elementType: 9 8 8 6 6 6 6 6 6 6 6 6 6 6 6 6 6 6 6 6 1 1 1 1 1 1 1 1 1 1 1 1 1 1 1 1 1 1 1 1 1
symmnumber: 1
zpe: 878375.8 jmol-1
zpe.correction: 0.334556 hartree
zpe.thermalcorrener: 0.355292 hartree
zpe.thermalcorrenthalpy: 0.356236 hartree
zpe.thermalcorrgfe: 0.282400 hartree
zpe.sumelectzpe: -909.169293 hartree
zpe.sumelectthermal: -909.148557 hartree
zpe.sumelectthermalent: -909.147613 hartree
zpe.sumelectthermalfe: -909.221449 hartree
dipole: -2.1192 -0.2402 0.5541
dipole: 2.2036
quadrupole: -124.6196 -108.3874 -123.3799
quadrupole: 2.9431 -8.3925 5.0794
quadrupole: -5.8240 10.4083 -4.5843 2.9431 -8.3925 5.0794
hfenergy: -909.5038487 hartree
pointgroup: C01 [X(C17H21F1O2)]
dipole: 0.8354979 0.1609196 -0.1664005 debye
polarizability: 265.4649956|-11.8434633|177.6940957|9.2164035|20.0194701|160.1339838 unknown
InChI: InChI=1S/C17H21FO2/c1-11(2)9-14-15(17(14,3)4)16(19)20-10-12-5-7-13(18)8-6-12/h5-9,14-15H,10H2,1-4H3
charge 0 multiplicity 1
41 atoms
F  -6.586329 -0.136245 -1.797515
O  -0.568431 -0.246387 0.206729
O  0.811512 -0.717693 2.034908
C  2.427074 1.853664 1.007696
C  3.0991 0.580932 0.469414
C  1.557973 0.797917 0.251278
C  2.291182 1.999731 2.52219
C  2.628655 3.183252 0.280592
C  4.020219 0.556277 -0.69517
C  0.621468 -0.111957 0.947362
C  5.030494 -0.337217 -0.919969
C  5.902619 -0.224567 -2.15965
C  5.384881 -1.492987 -0.001503
C  -1.59409 -1.172471 0.797748
C  -2.908436 -0.901326 0.109962
C  -3.649218 0.269895 0.415943
C  -3.424941 -1.809673 -0.846934
C  -4.879846 0.537559 -0.219103
C  -4.657804 -1.566342 -1.492725
C  -5.354686 -0.392991 -1.16096
H  3.292064 -0.16353 1.250722
H  1.23494 1.083924 -0.753395
H  2.10326 1.030826 3.013264
H  3.220019 2.432165 2.939843
H  1.45689 2.68103 2.777021
H  3.588118 3.643592 0.583376
H  2.637778 3.073919 -0.81762
H  1.815915 3.886808 0.539872
H  3.866374 1.342608 -1.449047
H  6.968477 -0.091556 -1.885191
H  5.84769 -1.148849 -2.76917
H  5.606408 0.62513 -2.799159
H  5.315866 -2.454974 -0.547422
H  6.432627 -1.405261 0.348917
H  4.735569 -1.564262 0.885343
H  -1.630334 -0.985401 1.885942
H  -1.24764 -2.208815 0.636825
H  -3.256451 0.980658 1.151452
H  -2.859649 -2.715162 -1.095065
H  -5.462502 1.435801 0.004175
H  -5.069511 -2.259119 -2.231974
