program: Gaussian 09
title: 000158152
version: EM64L-G09RevD.01
frameworkgroup: C1[X(C18H24O3)]
method: RPBEPBE
basis: SDD
operation: Freq
keyword: #pfreq=noraman
keyword: PBEPBE/SDD
title: #p freq=noraman PBEPBE/SDD
converged: YES YES NO NO
title: Mulliken charges:
elementType: O O O C C C C C C C C C C C C C C C C C C H H H H H H H H H H H H H H H H H H H H H H H H
charge: -0.297326 -0.264017 -0.273069 0.316923 -0.267516 -0.374090 -0.737725 -0.737266 -0.266635 0.271915 0.361206 -0.792358 -0.795720 -0.424555 0.397005 0.178681 -0.387394 -0.354874 -0.253030 -0.230544 -0.540208 0.259737 0.256164 0.265041 0.206207 0.200384 0.219513 0.213994 0.219520 0.194922 0.215479 0.217248 0.227384 0.220050 0.218184 0.235614 0.213779 0.259904 0.236881 0.240684 0.229107 0.226138 0.218884 0.223723 0.252056
chargesum: 0.00000
title: Mulliken charges with hydrogens summed into heavy atoms:
elementType: O O O C C C C C C C C C C C C C C C C C C
charge: -0.297326 -0.264017 -0.273069 0.316923 -0.007780 -0.117925 -0.066093 -0.084240 -0.071712 0.271915 0.361206 -0.132247 -0.121872 0.049128 0.397005 0.178681 -0.150513 -0.114190 -0.023922 -0.004406 0.154454
polarizability: 2.41225168e+02 5.32429541e+00 2.26839794e+02 1.72980844e+01 -2.86193878e+00 1.64588209e+02
1716.lowfreq: -10.1600 -5.0034 -3.4226 -0.0006 -0.0006 0.0002 7.9890 19.6407 28.5233
frequency: 4.3037 19.5482 28.4327 34.0885 45.2892 70.7790 96.1513 99.2287 113.1802 116.2469 130.9864 162.4072 169.7503 176.5589 188.8500 211.0147 221.5983 236.1181 241.1172 266.8714 277.5139 307.9333 312.0607 320.7191 353.4022 364.6777 411.8681 431.8908 450.7395 470.3144 482.9475 500.6533 518.2549 521.5529 554.2930 595.3633 610.9784 678.5359 720.3279 729.6673 741.2445 756.9045 786.7774 817.7837 837.3313 839.9273 860.3686 863.0746 902.4338 927.7813 940.2200 949.8444 954.1127 974.3650 976.3921 982.0926 988.0384 992.3066 1003.5153 1040.3211 1046.0515 1048.2600 1074.0067 1081.4424 1112.3421 1116.6671 1122.7451 1151.7752 1153.4323 1174.0054 1180.5227 1203.1319 1214.2398 1222.4169 1239.6872 1243.8900 1283.4150 1288.0352 1320.9656 1347.8790 1358.5137 1382.9346 1388.5138 1391.3469 1396.7667 1400.3808 1409.7478 1429.9113 1446.3365 1454.5588 1460.2226 1466.2057 1467.3594 1469.1378 1470.4339 1472.0127 1474.6209 1475.4040 1481.9245 1486.4914 1490.7076 1596.1335 1610.1367 1621.2811 1686.1428 2955.3999 2960.4753 2963.7306 2971.4328 2976.1042 3021.1809 3025.7991 3030.4232 3048.8463 3051.6819 3062.7359 3076.5120 3080.2453 3088.5230 3089.9401 3097.2702 3107.1765 3124.5051 3128.6724 3135.2776 3135.9761 3143.5334 3158.2858 3170.8957
redmass: 3.9617 3.0264 3.8728 5.0889 4.8589 3.9164 2.8534 3.5766 1.2110 2.7570 2.4315 1.3182 1.6234 1.4851 2.3499 1.9941 2.1584 1.9486 3.1713 1.9675 3.2303 3.1642 3.1334 2.7627 3.0958 2.4876 2.4703 3.1673 2.8073 3.8920 3.4385 2.8519 3.7821 3.9776 4.4765 5.5908 4.2502 4.7028 4.8944 3.9122 4.1612 1.4000 4.3876 3.8250 2.4851 3.2504 1.8929 1.6330 3.6899 2.4824 1.7529 1.3914 1.3681 1.4083 1.4041 1.8406 8.2986 1.2577 1.4595 1.5943 2.0620 1.6359 1.4267 1.5779 1.2632 1.8226 1.8721 2.0966 1.8427 1.1105 2.1534 1.8411 1.7087 1.9774 2.8893 2.3225 1.4988 1.3877 1.6606 1.4325 1.6841 1.2411 1.2882 6.9506 1.3015 1.2598 1.9975 1.3549 1.8049 1.0498 1.0578 1.0514 1.0848 1.1092 1.0576 1.0459 1.1264 1.0884 1.1303 1.0903 1.9879 7.0988 6.6190 9.7610 6.4026 1.0372 1.0329 1.0390 1.0375 1.0364 1.0570 1.0968 1.0964 1.1037 1.0989 1.0988 1.0980 1.0972 1.1074 1.0894 1.0959 1.0971 1.0875 1.0993 1.0892 1.0896 1.0861 1.0935 1.0990
irintensity: 0.2769 0.2607 0.4841 0.2483 1.1835 0.3744 6.0406 4.0241 0.2037 0.5113 0.1870 0.8355 0.9163 1.6609 0.4447 1.3805 0.3461 3.1763 6.5103 1.5159 1.6956 1.7654 0.3091 0.6172 1.2181 0.5217 2.7472 7.3186 3.9929 8.5897 8.7619 5.7307 13.7231 12.9854 0.7499 4.8628 3.9544 0.6580 2.6109 3.7836 7.0197 97.1450 10.1181 3.6954 5.8743 11.6503 5.7204 24.8688 50.0006 109.5267 36.7778 0.5713 1.0834 1.8990 18.4197 31.7645 39.6120 4.4818 15.2037 4.1093 10.6096 29.8186 3.1068 5.6294 0.5029 31.1356 84.0485 87.9827 38.3814 4.7104 35.4469 32.0712 62.2289 109.9061 99.9842 56.1737 26.3005 3.3799 1.8258 8.9979 16.2116 9.5229 24.9941 8.9552 15.8125 16.9536 7.8535 17.1088 11.2674 1.9941 7.2518 8.0877 48.8419 25.7134 9.1022 24.9768 14.1055 2.2468 13.0118 13.6682 35.5139 11.0724 21.3012 315.5927 1.5689 53.6078 56.5071 61.8153 30.9720 51.3041 35.8216 12.5336 41.2953 63.8154 11.8151 41.9165 19.5944 25.8873 14.3247 35.8628 35.3873 9.4695 5.7851 16.8593 10.3449 0.3707 14.7514 25.0821 17.3434
temp: 298.150 k
press: 1.00000 atm
elementType: 8 8 8 6 6 6 6 6 6 6 6 6 6 6 6 6 6 6 6 6 6 1 1 1 1 1 1 1 1 1 1 1 1 1 1 1 1 1 1 1 1 1 1 1 1
symmnumber: 1
zpe: 983317.3 jmol-1
zpe.correction: 0.374526 hartree
zpe.thermalcorrener: 0.397893 hartree
zpe.thermalcorrenthalpy: 0.398837 hartree
zpe.thermalcorrgfe: 0.318133 hartree
zpe.sumelectzpe: -924.347305 hartree
zpe.sumelectthermal: -924.323938 hartree
zpe.sumelectthermalent: -924.322994 hartree
zpe.sumelectthermalfe: -924.403697 hartree
dipole: -1.1731 0.2693 -3.2955
dipole: 3.5084
quadrupole: -108.5841 -114.0851 -134.0309
quadrupole: 4.5729 5.0948 8.3331
quadrupole: 10.3159 4.8149 -15.1309 4.5729 5.0948 8.3331
hfenergy: -924.7218306 hartree
pointgroup: C01 [X(C18H24O3)]
dipole: -0.2073983 -0.7833634 1.1174183 debye
polarizability: 227.34838|11.5920063|206.9313958|-28.7185654|28.5352746|198.3733948 unknown
InChI: InChI=1S/C18H24O3/c1-12(2)10-14-16(18(14,3)4)17(19)21-11-13-8-6-7-9-15(13)20-5/h6-10,14,16H,11H2,1-5H3
charge 0 multiplicity 1
45 atoms
O  -0.306402 0.360891 -0.776086
O  0.172035 2.59653 -1.280059
O  -2.067173 1.646178 1.446617
C  2.352489 0.472308 0.894544
C  2.504248 -0.300219 -0.429543
C  1.943642 1.162296 -0.446469
C  1.279825 0.008163 1.877329
C  3.590335 1.051459 1.580967
C  3.814528 -0.60184 -1.061765
C  0.551413 1.473986 -0.862951
C  4.114415 -1.673097 -1.856334
C  5.513175 -1.849217 -2.42494
C  3.130689 -2.761285 -2.248405
C  -1.752223 0.600888 -1.108269
C  -2.612929 -0.09668 -0.087754
C  -2.770012 0.455796 1.218727
C  -3.294068 -1.294296 -0.395613
C  -3.586051 -0.182928 2.182438
C  -4.116431 -1.942064 0.556087
C  -4.256247 -1.381573 1.84357
C  -2.212006 2.293158 2.752263
H  1.715636 -1.04304 -0.585845
H  2.635103 1.943018 -0.780441
H  0.396001 -0.397533 1.360954
H  1.694978 -0.77683 2.537938
H  0.946138 0.849409 2.515482
H  4.10181 0.270603 2.175445
H  4.322287 1.464813 0.865993
H  3.297681 1.866649 2.268873
H  4.621525 0.119641 -0.86469
H  5.959078 -2.809616 -2.096084
H  5.49208 -1.874799 -3.533078
H  6.190106 -1.034241 -2.114363
H  3.040786 -2.82172 -3.351464
H  3.488639 -3.75322 -1.907002
H  2.120663 -2.605039 -1.837668
H  -1.913064 0.181501 -2.116427
H  -1.909112 1.693219 -1.126041
H  -3.176421 -1.723826 -1.397991
H  -3.707618 0.238983 3.184473
H  -4.63764 -2.86877 0.295677
H  -4.888264 -1.872965 2.591863
H  -1.831047 1.645315 3.565653
H  -3.267568 2.560866 2.95303
H  -1.602828 3.206128 2.685959
