program: Gaussian 09
title: 000158150
version: EM64L-G09RevD.01
frameworkgroup: C1[X(C17H28O5)]
method: RPBEPBE
basis: SDD
operation: Freq
keyword: #pfreq=noraman
keyword: PBEPBE/SDD
title: #p freq=noraman PBEPBE/SDD
converged: NO YES NO NO
title: Mulliken charges:
elementType: O O O O O C C C C C C C C C C C C C C C C C H H H H H H H H H H H H H H H H H H H H H H H H H H H H
charge: -0.191082 -0.262835 -0.217252 -0.144181 -0.270168 0.141355 -0.085032 -0.192019 -0.031533 -0.133273 -0.486854 -0.066077 -0.476166 -0.458020 0.362128 -0.475568 -0.020231 -0.767419 -0.776007 -0.762840 -0.207564 -0.683879 0.231307 0.241684 0.207275 0.227468 0.228854 0.205496 0.283191 0.217797 0.223399 0.203684 0.195934 0.209340 0.238904 0.171854 0.214527 0.212886 0.232420 0.210487 0.205997 0.255223 0.228117 0.257900 0.229696 0.176078 0.235848 0.203366 0.234333 0.221455
chargesum: 0.00000
title: Mulliken charges with hydrogens summed into heavy atoms:
elementType: O O O O O C C C C C C C C C C C C C C C C C
charge: -0.191082 -0.262835 -0.217252 -0.144181 -0.270168 0.141355 0.146274 0.049665 0.175742 0.094196 -0.052504 0.217114 -0.034971 -0.058403 0.362128 -0.027324 0.151623 -0.107586 -0.104299 -0.047127 0.204362 -0.024726
polarizability: 2.22147340e+02 -1.51261733e+00 2.12797324e+02 4.09676157e+00 -1.15036554e+00 1.54705064e+02
1716.lowfreq: -14.5814 -0.0003 -0.0003 -0.0002 5.9184 9.4191 35.2401 56.6168 73.9196
frequency: 35.1864 56.6046 73.8984 85.3200 94.6637 111.9510 143.7036 169.6813 181.3349 191.8842 204.1681 214.6599 219.1017 236.1841 241.7937 243.8461 245.9817 262.4150 285.7796 293.8180 299.3692 328.3678 342.2930 358.3596 401.2562 406.9867 419.5113 436.0463 448.8467 460.4375 485.2588 490.8964 517.6669 537.8974 569.8685 586.0580 600.0149 655.3865 670.6608 695.6457 758.9177 790.7662 793.4495 811.7632 827.1485 837.4331 840.8268 851.7355 870.9956 874.8832 905.1750 922.5237 927.2248 941.3652 948.0586 963.6263 978.0796 981.7442 1021.8464 1022.7699 1027.9422 1043.9658 1053.4013 1064.8065 1071.4672 1085.0371 1095.1078 1108.6020 1112.2163 1116.0814 1131.8528 1138.1724 1151.6019 1155.0219 1163.4681 1177.2503 1192.1480 1211.8142 1216.9075 1239.8326 1247.6791 1260.0460 1266.6669 1272.2405 1280.1057 1291.7126 1300.0861 1307.8884 1310.0993 1322.2801 1325.3706 1331.3326 1336.4308 1342.4760 1350.3457 1350.7821 1360.1924 1365.7907 1381.5828 1382.4658 1388.6617 1391.3050 1403.8122 1451.2287 1451.8637 1459.5616 1460.2162 1462.9405 1467.1060 1467.4194 1475.9870 1477.5847 1480.2794 1486.6919 1491.1510 1492.9654 2848.4269 2933.6241 2940.2684 2945.8622 2953.4923 2960.0644 2963.7264 2973.4887 2977.7453 2979.8758 2991.8429 2993.2483 3002.7929 3006.1411 3026.1724 3026.4465 3041.7776 3044.5848 3048.5208 3062.8121 3066.8090 3067.1557 3083.8400 3090.7203 3100.7681 3101.5070 3108.6021 3119.3050
redmass: 3.2409 2.4379 2.4983 3.4397 3.0094 3.4693 3.5289 2.9028 2.7596 1.9111 1.4691 1.7971 1.1643 1.9841 1.5792 2.2816 1.6225 3.7271 3.2046 3.9299 2.7259 3.4811 4.0227 2.9537 4.4547 3.3041 3.0075 3.4769 3.1484 4.8568 2.8591 5.0874 4.3836 5.2978 3.5750 3.9412 2.8927 3.5601 3.7279 4.6947 3.4000 4.0278 5.1063 1.0988 2.4730 2.1467 2.8475 2.7583 2.3463 2.4160 2.8842 2.2523 2.0843 2.8560 1.9296 2.3144 1.8219 2.1316 2.4246 3.0548 2.2500 1.9941 2.1413 2.2661 1.7919 2.4997 3.2436 4.0038 2.0963 2.6479 2.4061 1.4824 2.1714 2.3395 2.8721 2.0029 2.2334 2.0972 1.6960 1.3968 1.1535 1.3597 1.2267 1.4306 1.3082 1.2770 1.2514 1.2733 1.2882 1.3743 1.2886 1.4188 1.4946 1.4508 1.3933 1.4944 1.3924 1.4156 1.2791 1.2325 1.2061 1.2354 1.4079 1.0774 1.0563 1.0811 1.0409 1.0842 1.0515 1.0525 1.0603 1.0792 1.0490 1.0480 1.0607 1.0814 1.0812 1.0807 1.0658 1.0832 1.0803 1.0794 1.0682 1.0382 1.0536 1.0487 1.0597 1.0359 1.0569 1.0403 1.0965 1.0851 1.0965 1.0996 1.1005 1.0989 1.0986 1.1011 1.0981 1.0988 1.0976 1.1012 1.1001 1.1005
irintensity: 0.3187 0.3144 2.2345 0.8821 1.4575 1.3382 2.2115 3.9871 0.9180 0.6166 0.3871 0.1409 0.2117 0.9626 0.2793 0.4559 0.3370 1.0803 1.4702 6.3605 0.5924 1.9789 4.9934 2.2157 1.9465 2.4617 0.1747 4.7094 0.3086 7.2604 6.8103 3.1223 3.5622 0.9683 0.9760 4.8423 1.1333 0.3374 2.6990 9.0316 41.0097 3.9479 20.3556 4.7726 5.9351 0.5493 11.7285 17.9961 7.0823 83.4200 201.5385 27.4427 45.8547 218.6170 0.7607 11.6867 5.5971 30.1063 3.4260 13.3816 20.6661 30.0646 6.8423 13.4992 18.4591 17.8071 47.7035 124.6985 3.9650 22.8070 7.7192 17.5519 2.7222 11.4994 7.3674 10.1996 12.0202 15.1764 6.6369 2.6284 3.7019 2.2418 7.3638 3.5080 2.8622 4.1186 2.3904 7.6076 1.2801 5.9467 8.4663 9.4012 3.9342 3.2128 6.1186 6.7382 2.6230 7.9938 14.7106 25.7952 16.1379 19.7275 9.3414 6.6574 10.4588 8.6133 11.5084 6.2279 3.6080 19.8446 8.9090 4.6507 6.9270 9.9294 8.6248 7.2480 66.3714 5.3484 52.4668 43.7207 14.5515 1.5600 47.6565 48.8074 32.7303 38.4365 26.2047 28.7199 20.1950 30.9094 46.5857 3.5535 14.0529 45.6621 27.3878 44.1844 27.0445 38.8037 33.5931 36.3107 22.8089 36.6662 13.0061 12.2918
temp: 298.150 k
press: 1.00000 atm
elementType: 8 8 8 8 8 6 6 6 6 6 6 6 6 6 6 6 6 6 6 6 6 6 1 1 1 1 1 1 1 1 1 1 1 1 1 1 1 1 1 1 1 1 1 1 1 1 1 1 1 1
symmnumber: 1
zpe: 1123794.7 jmol-1
zpe.correction: 0.428031 hartree
zpe.thermalcorrener: 0.449827 hartree
zpe.thermalcorrenthalpy: 0.450771 hartree
zpe.thermalcorrgfe: 0.379656 hartree
zpe.sumelectzpe: -1038.881189 hartree
zpe.sumelectthermal: -1038.859392 hartree
zpe.sumelectthermalent: -1038.858448 hartree
zpe.sumelectthermalfe: -1038.929564 hartree
dipole: -2.3334 -2.2248 -2.2385
dipole: 3.9250
quadrupole: -125.5112 -126.0935 -136.6012
quadrupole: -2.5567 -4.5823 -0.5791
quadrupole: 3.8908 3.3085 -7.1992 -2.5567 -4.5823 -0.5791
hfenergy: -1039.3092193 hartree
pointgroup: C01 [X(C17H28O5)]
dipole: -0.925581 0.860575 0.887291 debye
polarizability: 222.1676372|1.6045431|212.8303794|-3.7845059|-0.4543785|154.651712 unknown
InChI: InChI=1S/C17H28O5/c1-5-18-14-11(3)13-7-6-10(2)12-8-9-16(4)20-15(19-14)17(12,13)22-21-16/h10-15H,5-9H2,1-4H3
charge 0 multiplicity 1
50 atoms
O  -0.679774 -0.598627 -1.656612
O  -0.570735 -1.842704 1.028641
O  1.404003 -0.703766 0.540323
O  -0.320369 -2.065773 -1.357176
O  3.491294 0.229243 0.008017
C  -0.742858 0.221765 -0.385474
C  -2.268444 0.462731 -0.122115
C  0.020424 1.52948 -0.759771
C  -2.545334 1.649117 0.854412
C  -0.031331 -0.526088 0.780936
C  -0.275949 2.667572 0.253595
C  1.538127 1.245671 -0.981337
C  -3.016613 -0.820214 0.33514
C  -1.78836 2.917864 0.39982
C  -1.113388 -2.498769 -0.203489
C  -2.611691 -2.133213 -0.369834
C  2.127214 0.56614 0.264527
C  -4.057772 1.944877 0.987267
C  2.33859 2.50102 -1.382116
C  -0.81352 -3.987717 -0.06903
C  4.19015 -0.383237 1.162672
C  5.640258 -0.606316 0.739601
H  -2.667893 0.758875 -1.116966
H  -0.394816 1.851124 -1.738927
H  -2.164461 1.364295 1.860765
H  -0.177478 0.04145 1.725135
H  0.222223 3.591219 -0.093024
H  0.153187 2.434449 1.248819
H  1.613232 0.494325 -1.789872
H  -4.099002 -0.668627 0.168629
H  -2.873296 -0.953252 1.424569
H  -1.967626 3.734127 1.126765
H  -2.203054 3.259458 -0.572189
H  -3.218447 -2.955869 0.053541
H  -2.826801 -2.085531 -1.452822
H  2.050853 1.209304 1.179266
H  -4.220249 2.851926 1.598945
H  -4.509836 2.124337 -0.007629
H  -4.607498 1.117579 1.467736
H  1.861674 3.010912 -2.240228
H  2.416647 3.228726 -0.552826
H  3.362787 2.214375 -1.670669
H  -1.325982 -4.562123 -0.858829
H  0.272864 -4.159117 -0.133649
H  -1.166157 -4.331401 0.918109
H  4.121664 0.306292 2.033294
H  3.686631 -1.33204 1.42331
H  6.21493 -1.063611 1.565742
H  5.684357 -1.280861 -0.13254
H  6.120126 0.3487 0.463548
