program: Gaussian 09
title: 000158136
version: EM64L-G09RevD.01
frameworkgroup: C1[X(C20H28O3)]
method: RPBEPBE
basis: SDD
operation: Freq
keyword: #pfreq=noraman
keyword: PBEPBE/SDD
title: #p freq=noraman PBEPBE/SDD
converged: YES YES NO NO
title: Mulliken charges:
elementType: O O O C C C C C C C C C C C C C C C C C C C C H H H H H H H H H H H H H H H H H H H H H H H H H H H H
charge: -0.274103 -0.277405 -0.282431 0.312291 -0.270455 -0.385544 -0.736511 -0.748155 -0.260695 0.261512 0.357645 -0.794212 -0.791673 -0.437852 0.482254 -0.421239 -0.346940 -0.364410 -0.390271 0.376658 0.024422 -0.690257 -0.691940 0.257386 0.265503 0.221430 0.212951 0.219922 0.263128 0.211235 0.207029 0.194987 0.236592 0.219290 0.220340 0.227503 0.217623 0.216344 0.224473 0.232691 0.229797 0.236878 0.237758 0.249701 0.196299 0.229071 0.243966 0.212258 0.225876 0.235372 0.203911
chargesum: 0.00000
title: Mulliken charges with hydrogens summed into heavy atoms:
elementType: O O O C C C C C C C C C C C C C C C C C C C C
charge: -0.274103 -0.277405 -0.282431 0.312291 -0.013069 -0.120041 -0.082208 -0.066762 -0.065708 0.261512 0.357645 -0.117990 -0.130203 0.019312 0.482254 -0.191443 -0.110062 -0.126652 -0.140571 0.376658 0.220721 -0.004963 -0.026782
polarizability: 3.32101358e+02 1.05317412e+01 2.26382449e+02 -2.30037017e+01 -9.01730895e+00 1.80749603e+02
1716.lowfreq: -12.1370 -5.9700 -0.0007 0.0003 0.0009 3.5326 5.7517 15.8919 19.5583
frequency: -6.7784 15.1255 19.3486 28.2521 41.6153 56.4285 76.5097 83.2773 90.1747 102.4103 125.1965 128.3047 137.2639 159.1986 169.2825 174.6902 189.5950 192.1411 209.2433 237.6168 239.3310 256.8416 274.5086 281.8943 291.8872 307.9875 335.0978 353.3075 369.3878 373.4613 413.1320 415.4200 420.2554 435.4092 456.6289 465.4360 500.6916 510.9565 533.3153 560.9671 626.4512 631.4961 687.5047 719.1873 728.5712 746.1550 801.0382 813.4160 818.0199 827.4962 832.9045 852.5914 861.6105 868.6232 890.0061 921.4998 928.2830 937.9298 943.2515 945.3377 949.9418 957.2687 963.4228 966.3236 978.9035 992.0613 1004.0425 1012.4855 1037.0682 1053.6681 1075.0991 1081.4855 1103.9448 1114.1196 1121.9494 1126.8463 1150.7398 1165.1538 1175.8061 1186.6071 1190.6477 1196.5394 1220.6126 1235.1450 1242.6878 1286.4693 1305.1425 1318.9963 1323.5666 1342.1021 1343.3719 1369.6317 1381.1205 1383.5723 1386.6496 1389.8681 1397.0270 1399.3573 1401.3595 1419.3612 1420.9994 1454.1202 1455.1375 1463.7774 1466.0712 1468.8137 1469.2054 1470.3347 1470.8884 1470.9520 1475.4761 1484.9629 1488.8736 1491.4522 1503.1228 1582.2478 1610.3971 1625.0549 1685.6163 2955.4734 2964.8297 2973.0126 2976.4209 2977.6180 2989.3558 2994.4113 3010.9544 3025.9835 3031.6047 3056.2754 3064.9235 3073.5618 3076.0897 3081.1921 3085.0973 3089.9652 3094.3507 3095.8591 3096.3455 3097.1720 3103.1834 3120.5925 3124.9968 3132.0515 3150.1227 3164.3307 3167.7195
redmass: 4.1572 3.6654 3.1793 3.6993 3.7998 4.1968 3.8630 2.9945 2.1211 1.4342 3.5134 3.9845 2.6947 1.9809 1.5265 1.8549 1.6935 1.0391 2.3908 1.2328 1.3922 3.4037 3.9556 2.8762 3.1235 2.5360 2.9082 3.2731 3.0060 2.6698 2.9568 2.5052 2.8268 3.3079 2.7117 2.9392 2.8205 3.2389 2.9663 4.3014 4.2331 6.3432 5.7739 3.8356 4.9846 4.3318 2.9097 2.0388 2.6737 1.6560 3.4715 3.5821 1.5915 3.7964 3.3710 2.4018 1.4031 1.4565 1.3938 1.7920 1.4190 1.5333 1.4511 1.6947 1.5716 1.2526 2.6558 1.5852 1.7170 1.7380 1.4031 1.5551 1.6943 2.1519 1.3327 1.8339 2.0516 2.5191 1.4425 1.7572 1.0989 2.0741 2.2384 3.1153 2.4333 1.7574 1.3106 1.2795 1.6863 1.4025 1.5980 1.7331 1.5412 2.5365 1.2311 1.2817 1.2394 1.2559 1.2632 2.2225 3.6136 1.0496 1.0486 1.0526 1.0521 1.0530 1.0972 1.0472 1.0501 1.0482 1.0856 1.1440 1.0594 1.0566 2.6914 7.0251 9.6771 6.5414 6.3767 1.0373 1.0391 1.0369 1.0842 1.0363 1.0359 1.0360 1.0576 1.0969 1.0963 1.0989 1.0988 1.1075 1.0981 1.0969 1.0990 1.0899 1.0999 1.0983 1.0998 1.0960 1.1004 1.0876 1.0896 1.0893 1.0888 1.0939 1.0954
irintensity: 0.0597 0.6904 0.0730 0.2563 0.7134 0.8108 1.1780 0.6544 0.3691 0.2197 1.0547 0.6306 1.2326 0.5665 0.3844 3.1259 1.5746 0.1317 4.0449 0.6847 2.5074 2.6374 5.4824 0.1175 4.7873 2.7779 0.9413 0.4683 4.5044 2.4200 1.4280 1.3453 0.0960 9.9370 1.5323 2.2963 12.1483 7.8750 13.2573 22.8353 4.6176 2.6185 10.7318 4.1084 7.0175 14.2542 93.5358 11.0456 2.8237 16.3548 56.2514 41.5488 20.5883 5.9994 47.2531 46.3640 20.9459 0.5744 0.8244 29.0627 4.7256 1.5113 6.2672 17.7677 82.5483 2.1112 3.8629 23.9948 43.5053 70.3896 7.2219 5.3727 203.1140 527.8302 19.8386 7.4267 11.3493 79.6522 12.6084 116.7246 13.8741 54.7515 155.3397 83.3483 38.4955 57.7363 6.3667 19.7664 23.0862 2.9059 35.5064 66.1990 17.3038 20.4040 13.5271 38.5163 34.8794 14.3916 18.6160 64.8674 2.7088 1.7271 5.9161 20.5882 3.4128 5.8793 5.0487 20.6129 11.2639 5.1655 2.6148 12.7574 13.6762 16.7272 121.0670 14.8222 175.4931 92.2808 5.6111 50.2585 63.7270 32.3693 26.2021 52.4609 17.1590 27.1456 20.9827 13.7709 40.2109 18.0318 47.6778 13.2910 21.8657 26.2173 16.1243 31.7649 34.4876 8.0584 33.0888 29.9323 36.8267 11.5501 14.6260 15.0735 4.2546 19.2665 5.2628
temp: 298.150 k
press: 1.00000 atm
elementType: 8 8 8 6 6 6 6 6 6 6 6 6 6 6 6 6 6 6 6 6 6 6 6 1 1 1 1 1 1 1 1 1 1 1 1 1 1 1 1 1 1 1 1 1 1 1 1 1 1 1 1
symmnumber: 1
zpe: 1127445.2 jmol-1
zpe.correction: 0.429421 hartree
zpe.thermalcorrener: 0.454813 hartree
zpe.thermalcorrenthalpy: 0.455757 hartree
zpe.thermalcorrgfe: 0.372102 hartree
zpe.sumelectzpe: -1002.808001 hartree
zpe.sumelectthermal: -1002.782609 hartree
zpe.sumelectthermalent: -1002.781665 hartree
zpe.sumelectthermalfe: -1002.865321 hartree
dipole: -1.8198 0.0029 1.9276
dipole: 2.6510
quadrupole: -108.9190 -135.1706 -139.8148
quadrupole: 11.4020 -1.6089 -5.6061
quadrupole: 19.0492 -7.2025 -11.8467 11.4020 -1.6089 -5.6061
hfenergy: -1003.2374224 hartree
pointgroup: C01 [X(C20H28O3)]
dipole: -0.7075772 -0.7563061 0.1229549 debye
polarizability: 332.7234892|24.9207691|182.6520095|-0.2303858|10.7774441|223.8579111 unknown
InChI: InChI=1S/C20H28O3/c1-13(2)11-17-18(20(17,5)6)19(21)22-12-15-7-9-16(10-8-15)23-14(3)4/h7-11,14,17-18H,12H2,1-6H3
charge 0 multiplicity 1
51 atoms
O  0.497895 -0.078833 -0.913908
O  2.089906 1.223074 -2.025533
O  -5.370315 -0.396351 1.517242
C  3.880298 -1.423405 -1.735869
C  4.241458 -0.431142 -0.616826
C  2.742121 -0.831203 -0.846447
C  4.157383 -2.914928 -1.547648
C  4.034587 -0.950559 -3.180145
C  4.930256 -0.81509 0.641681
C  1.80513 0.206707 -1.337083
C  5.773659 -0.03627 1.384155
C  6.15501 1.393926 1.045538
C  6.412282 -0.578419 2.652529
C  -0.550476 0.925718 -1.326811
C  -1.8295 0.575082 -0.616328
C  -2.873855 -0.103401 -1.285788
C  -2.018053 0.915835 0.75049
C  -4.078297 -0.440934 -0.628656
C  -3.205288 0.583944 1.423665
C  -4.244022 -0.099877 0.73825
C  -6.537085 -1.085528 0.894145
C  -7.374385 -0.08085 0.082527
C  -7.307669 -1.69575 2.069266
H  4.45133 0.577252 -0.991639
H  2.296961 -1.523867 -0.126603
H  3.518833 -3.509331 -2.227348
H  3.960482 -3.260029 -0.517892
H  5.213692 -3.143321 -1.785126
H  3.787402 0.11814 -3.29127
H  5.077275 -1.108069 -3.515164
H  3.371685 -1.526788 -3.853841
H  4.733771 -1.834323 1.006251
H  5.662809 1.775569 0.13708
H  7.250542 1.481536 0.901804
H  5.892477 2.072461 1.881545
H  6.106954 -1.619698 2.85571
H  6.136387 0.038429 3.531385
H  7.518589 -0.552441 2.584487
H  -0.651934 0.872805 -2.425368
H  -0.168723 1.92828 -1.062705
H  -2.749099 -0.377851 -2.340435
H  -1.22039 1.438965 1.29095
H  -4.862472 -0.962475 -1.184435
H  -3.355942 0.838008 2.477261
H  -6.156531 -1.896651 0.239112
H  -7.772545 0.703256 0.750381
H  -6.777523 0.409244 -0.705762
H  -8.226986 -0.59435 -0.398913
H  -7.636264 -0.902807 2.763691
H  -6.670874 -2.403062 2.627028
H  -8.199846 -2.234823 1.702772
