program: Gaussian 09
title: 000158135
version: EM64L-G09RevD.01
frameworkgroup: C1[X(C19H26O3)]
method: RPBEPBE
basis: SDD
operation: Freq
keyword: #pfreq=noraman
keyword: PBEPBE/SDD
title: #p freq=noraman PBEPBE/SDD
converged: YES YES NO NO
title: Mulliken charges:
elementType: O O O C C C C C C C C C C C C C C C C C C C H H H H H H H H H H H H H H H H H H H H H H H H H H
charge: -0.274538 -0.277661 -0.265745 0.312169 -0.269463 -0.388255 -0.748574 -0.737287 -0.262532 0.264245 0.358692 -0.794649 -0.791739 -0.436411 0.485383 -0.344875 -0.421239 -0.368287 -0.355869 0.341012 -0.244768 -0.684798 0.257673 0.265760 0.263487 0.211258 0.207134 0.220073 0.213130 0.221737 0.195912 0.220334 0.219499 0.237032 0.227592 0.217714 0.216444 0.224731 0.234289 0.238229 0.229870 0.249429 0.244680 0.208847 0.208086 0.232414 0.232651 0.207187
chargesum: 0.00000
title: Mulliken charges with hydrogens summed into heavy atoms:
elementType: O O O C C C C C C C C C C C C C C C C C C C
charge: -0.274538 -0.277661 -0.265745 0.312169 -0.011790 -0.122495 -0.066695 -0.082348 -0.066620 0.264245 0.358692 -0.117785 -0.129990 0.022609 0.485383 -0.106645 -0.191368 -0.118858 -0.111189 0.341012 0.172164 -0.012547
polarizability: 3.13918323e+02 1.10412309e+01 2.20842669e+02 -2.15455505e+01 -7.92063731e+00 1.67612805e+02
1716.lowfreq: -7.2395 -5.7054 -0.0004 0.0004 0.0005 3.5090 4.3940 9.5731 16.9046
frequency: -2.6992 8.9808 15.6113 25.2282 42.3091 60.7081 78.2152 86.0134 103.4240 116.5267 126.5207 131.5114 140.4828 162.5867 174.1216 179.0178 193.2231 212.1143 241.0921 246.7625 258.1455 275.4751 284.5095 305.8941 328.7389 335.2127 359.8868 375.8449 413.5072 415.5995 420.5609 435.6590 461.2891 500.6044 510.1039 527.3313 560.5246 625.7526 631.8758 689.5942 719.5139 729.1198 760.1662 800.6418 808.5995 818.7082 827.1019 832.0708 838.0581 860.4768 868.5304 888.5694 902.9042 936.1835 945.8473 949.9032 958.8896 963.9375 968.3667 979.3291 990.8271 1004.1994 1012.9547 1036.2451 1037.1413 1053.6863 1074.6899 1081.4582 1112.8674 1114.9401 1120.9013 1126.9158 1135.7947 1165.4409 1178.9180 1191.9218 1196.6228 1222.9118 1234.9248 1242.7243 1260.7654 1286.3195 1305.6554 1323.4342 1343.4244 1363.2970 1370.1951 1386.4628 1386.9030 1390.2001 1399.6309 1400.4163 1401.8639 1418.9280 1420.6598 1454.0568 1461.6894 1463.7267 1466.2246 1470.0359 1471.5511 1472.3928 1475.9901 1476.7892 1485.1952 1487.7126 1491.5560 1507.2511 1584.5393 1610.3227 1626.4022 1685.6588 2953.6604 2955.9631 2964.3197 2973.3021 2977.0909 2997.0848 3009.7383 3011.8334 3026.4082 3030.9162 3057.0482 3065.3310 3072.1703 3076.9176 3079.2528 3089.4140 3094.4494 3095.7541 3096.9507 3106.1590 3117.8338 3125.4846 3133.8265 3152.4095 3164.0188 3167.9443
redmass: 4.0752 3.3579 3.1350 3.9201 3.9207 4.2000 4.0130 1.9233 1.5261 1.7607 4.5215 3.2868 2.9504 2.4782 1.7575 1.5664 1.5463 2.3733 1.5062 1.2219 3.3324 3.7117 2.9421 2.5891 3.7117 2.9306 3.1085 2.7897 2.9373 2.5367 3.6368 3.2258 2.8628 2.8661 3.1862 3.0331 4.2972 4.2459 6.5549 6.1422 3.6559 5.0651 4.2919 2.0737 1.8702 3.4538 1.7985 1.1346 3.9988 1.5989 3.9029 3.3281 3.3194 1.4358 1.7892 1.4410 1.5124 1.5226 1.6306 1.5948 1.2528 2.6225 1.5944 2.3894 1.9300 1.7167 1.4000 1.5658 2.1827 1.9328 1.4077 1.8279 1.4375 2.5342 1.2742 1.0991 2.0558 2.2634 3.3661 2.4341 1.1429 1.7457 1.2973 1.6747 1.6088 1.4317 1.6904 2.5803 1.3791 1.2883 1.2502 1.3188 1.2567 2.2489 3.5865 1.0497 1.0400 1.0532 1.0538 1.0958 1.0510 1.0492 1.0828 1.0783 1.1406 1.1320 1.0604 2.3643 7.0516 9.6706 6.4709 6.3637 1.0553 1.0374 1.0392 1.0367 1.0363 1.0362 1.0576 1.1075 1.0969 1.0962 1.0989 1.0988 1.1074 1.0978 1.0979 1.0894 1.0989 1.0984 1.0958 1.1014 1.0876 1.0895 1.0893 1.0889 1.0940 1.0958
irintensity: 0.0833 0.7994 0.1142 0.1999 0.8891 0.7915 1.2096 0.3527 0.4520 3.0371 0.9008 0.5079 1.5961 0.8555 1.1740 3.2667 1.2962 4.2666 3.7058 0.6212 1.4837 7.5651 1.9237 0.4842 6.0050 1.0064 0.1460 0.5877 2.4306 0.6053 1.3686 6.3098 1.2945 15.4254 6.0424 17.6732 23.7967 5.5186 1.6371 13.9568 5.9507 7.5319 4.7149 92.2000 9.9780 1.0702 23.8533 1.8724 73.6535 19.1306 7.1501 52.0675 37.5596 3.2332 26.0582 6.3848 3.1850 11.3314 7.3351 83.9557 2.4382 5.0170 25.1566 111.5925 8.6388 62.3602 6.2817 4.7498 601.1761 9.5830 15.2303 5.3629 4.4061 85.1293 70.0899 3.6767 67.0292 153.7132 111.7039 38.5550 0.1425 58.7170 3.0614 25.1575 37.7237 2.5616 68.9199 12.7181 8.8986 39.8478 20.7633 32.4816 17.7043 63.6704 4.7422 1.5736 11.8780 19.5521 3.5712 5.7379 20.4137 11.9428 2.8690 28.8010 15.1645 28.8849 14.2761 79.3678 14.1598 174.5559 80.2894 5.8960 40.9535 47.4667 64.7909 29.1735 54.1268 27.5100 19.6734 37.5250 10.2428 43.5611 16.6988 47.9858 13.7528 17.4770 32.6251 30.6050 29.4495 7.5201 29.2994 34.5234 12.6435 15.1414 13.7838 4.0404 17.9903 3.9896
temp: 298.150 k
press: 1.00000 atm
elementType: 8 8 8 6 6 6 6 6 6 6 6 6 6 6 6 6 6 6 6 6 6 6 1 1 1 1 1 1 1 1 1 1 1 1 1 1 1 1 1 1 1 1 1 1 1 1 1 1
symmnumber: 1
zpe: 1055693.0 jmol-1
zpe.correction: 0.402092 hartree
zpe.thermalcorrener: 0.426069 hartree
zpe.thermalcorrenthalpy: 0.427013 hartree
zpe.thermalcorrgfe: 0.345461 hartree
zpe.sumelectzpe: -963.580286 hartree
zpe.sumelectthermal: -963.556309 hartree
zpe.sumelectthermalent: -963.555365 hartree
zpe.sumelectthermalfe: -963.636917 hartree
dipole: -1.5967 -0.0541 1.8756
dipole: 2.4638
quadrupole: -102.8607 -127.7440 -134.2304
quadrupole: 11.7419 -1.6102 -5.1040
quadrupole: 18.7510 -6.1323 -12.6187 11.7419 -1.6102 -5.1040
hfenergy: -963.982378 hartree
pointgroup: C01 [X(C19H26O3)]
dipole: -0.6577832 -0.6541043 0.2811638 debye
polarizability: 316.6440656|16.2768563|176.9713852|-2.1123122|22.4363996|208.7583459 unknown
InChI: InChI=1S/C19H26O3/c1-6-21-15-9-7-14(8-10-15)12-22-18(20)17-16(11-13(2)3)19(17,4)5/h7-11,16-17H,6,12H2,1-5H3
charge 0 multiplicity 1
48 atoms
O  0.15354 -0.212413 -0.979447
O  1.816981 0.761792 -2.301562
O  -5.757216 0.37694 1.331924
C  3.519485 -1.789341 -1.365622
C  3.871816 -0.580871 -0.48196
C  2.369081 -0.992852 -0.673563
C  3.732598 -1.653234 -2.871933
C  3.751489 -3.206127 -0.840609
C  4.51083 -0.686566 0.854272
C  1.480424 -0.066844 -1.413772
C  5.324934 0.237965 1.447456
C  5.717041 1.569508 0.83187
C  5.916213 -0.020596 2.823637
C  -0.845715 0.707001 -1.636042
C  -2.143165 0.598072 -0.88102
C  -2.292901 1.20539 0.395894
C  -3.244343 -0.102792 -1.423306
C  -3.500788 1.111419 1.105921
C  -4.470644 -0.204935 -0.727776
C  -4.597273 0.405591 0.544996
C  -6.934897 -0.339197 0.801163
C  -8.038206 -0.209145 1.84758
H  4.119195 0.315475 -1.06277
H  1.882181 -1.498673 0.164749
H  3.512301 -0.632899 -3.2268
H  4.782378 -1.895181 -3.124334
H  3.080412 -2.356182 -3.424809
H  4.810584 -3.496776 -0.975541
H  3.505777 -3.312632 0.230289
H  3.125953 -3.926595 -1.399733
H  4.301851 -1.60796 1.418092
H  5.425005 2.404502 1.499516
H  6.816937 1.634228 0.710591
H  5.256946 1.751654 -0.1523
H  5.607343 -0.999914 3.228967
H  5.604732 0.762851 3.543476
H  7.02415 0.003682 2.791897
H  -0.948858 0.395981 -2.690824
H  -0.418013 1.725745 -1.616946
H  -1.449248 1.749602 0.836164
H  -3.14779 -0.581897 -2.405268
H  -3.625238 1.574573 2.08946
H  -5.302451 -0.753132 -1.179201
H  -6.670732 -1.40216 0.623473
H  -7.238483 0.116118 -0.164162
H  -8.283397 0.851892 2.024497
H  -7.720862 -0.656123 2.805033
H  -8.951454 -0.72794 1.50358
