program: Gaussian 09
title: 000158129
version: EM64L-G09RevD.01
frameworkgroup: C1[X(C17H21BrO2)]
method: RPBEPBE
basis: SDD
operation: Freq
keyword: #p
keyword: freq=noraman
keyword: PBEPBE/SDD
title: #p freq=noraman PBEPBE/SDD
converged: YES YES NO NO
title: Mulliken charges:
elementType: Br O O C C C C C C C C C C C C C C C C C H H H H H H H H H H H H H H H H H H H H H
charge: 0.004358 -0.291366 -0.268189 0.312221 -0.267905 -0.402868 -0.747153 -0.736687 -0.262681 0.271765 0.359031 -0.790433 -0.793989 -0.380408 0.439343 -0.370423 -0.403791 -0.175418 -0.184026 -0.210440 0.259598 0.265990 0.262471 0.213696 0.208206 0.222654 0.213461 0.222197 0.196920 0.217738 0.218992 0.227827 0.222084 0.220991 0.235942 0.248018 0.236455 0.263461 0.240008 0.250271 0.252079
chargesum: 0.00000
title: Mulliken charges with hydrogens summed into heavy atoms:
elementType: Br O O C C C C C C C C C C C C C C C C C
charge: 0.004358 -0.291366 -0.268189 0.312221 -0.008307 -0.136878 -0.062780 -0.078375 -0.065761 0.271765 0.359031 -0.125876 -0.114973 0.104065 0.439343 -0.106962 -0.163783 0.074853 0.068053 -0.210440
polarizability: 3.04799032e+02 -6.38808379e+00 1.65651805e+02 1.14963385e+01 -1.39650336e+01 1.82553679e+02
1716.lowfreq: -3.6061 0.0006 0.0007 0.0008 3.5497 8.7742 16.1792 17.0776 28.7027
frequency: 11.6506 17.0281 28.6544 33.1374 44.7740 78.3798 93.7987 102.2342 112.1855 135.9622 138.1674 165.1684 172.4473 184.4104 190.6865 213.9419 236.8859 255.0473 272.6692 283.1128 293.4959 317.3427 338.3320 357.8827 380.1921 405.0776 417.3155 443.6895 466.9062 493.8086 507.7151 516.1876 598.7052 623.2473 625.3994 700.4580 712.8677 728.8328 801.1848 812.7207 818.1785 831.0648 836.8794 860.1705 883.7564 895.2923 946.0350 949.6071 956.4691 972.5975 974.7198 983.4768 991.3204 995.9439 1000.1438 1015.5371 1039.3086 1055.8996 1060.5634 1075.9077 1082.1345 1112.0010 1115.6880 1126.7435 1166.4219 1187.4119 1198.0662 1198.2621 1221.7599 1244.8473 1287.5982 1294.7913 1324.9677 1337.9268 1368.1757 1380.9040 1389.5406 1391.3261 1395.1185 1401.7449 1403.4401 1421.2879 1454.5023 1464.9241 1466.8077 1467.5721 1471.8780 1472.2724 1475.1833 1476.8826 1485.8004 1490.1512 1582.3857 1602.7500 1619.4971 1685.1305 2957.6460 2965.9040 2974.5799 2979.0375 2990.5780 3028.6866 3033.2727 3049.3113 3058.2965 3066.6387 3078.4146 3082.8422 3092.2605 3096.3383 3097.3837 3122.4406 3128.0806 3151.1615 3156.2804 3170.2673 3176.3729
redmass: 4.7981 4.0276 3.5348 6.3200 3.7242 3.8458 3.0671 1.9064 1.8856 2.8190 3.9484 2.0119 2.3736 1.7645 1.4002 2.4603 1.4699 3.5599 3.8814 3.3509 3.7082 5.8467 2.9038 3.3278 2.6735 2.8884 2.4753 2.8230 2.8408 3.0699 2.9145 3.6155 6.1480 6.6335 4.3324 3.6664 6.1143 5.5283 2.4185 2.7605 2.2382 3.1381 1.2587 1.6202 3.3097 6.2952 1.3503 1.3913 1.4505 1.6855 1.3813 1.9828 1.2562 3.3386 1.9557 1.7206 1.7639 1.7723 2.5362 1.4072 1.5732 1.4208 2.0995 1.8614 2.6142 1.1138 1.7410 1.2793 2.1387 2.4543 1.6916 1.3196 1.7016 2.0569 1.9703 3.7497 1.2387 1.2772 2.2167 1.2647 1.2706 2.1412 1.0496 1.0538 1.0606 1.1474 1.0540 1.0464 2.1482 1.0851 1.1313 1.0664 7.4992 6.1256 9.6402 6.3386 1.0372 1.0391 1.0370 1.0364 1.0583 1.0969 1.0963 1.1041 1.0990 1.0988 1.0982 1.0974 1.0894 1.0963 1.0984 1.0877 1.0900 1.0890 1.0883 1.0952 1.0971
irintensity: 0.1133 0.2748 0.5100 0.2911 1.4607 1.1599 1.5769 0.6744 0.0631 0.0722 0.8826 0.9587 2.9399 1.2670 1.8401 2.6712 3.5375 0.5170 6.4015 1.3261 2.5283 21.9050 0.8345 0.9438 0.5553 0.7193 2.0332 10.1487 8.0923 23.5512 3.9087 8.6516 10.5181 0.4469 1.6291 1.6616 1.7280 6.2834 36.0137 23.5307 25.2635 40.7928 4.1895 26.8734 59.2619 4.2758 3.1905 2.0328 6.2756 8.7461 0.4064 116.7353 1.8122 30.5790 21.7665 21.3912 36.5026 60.6524 30.4153 6.5501 4.7315 62.7501 504.1477 9.7851 63.5925 0.1701 44.8109 21.5272 2.6497 49.7056 60.9808 1.8032 26.3096 7.0351 85.7815 9.5393 2.2320 48.5558 9.4397 16.9323 18.8242 71.7819 1.6947 30.3192 1.7165 28.6560 10.9475 18.9652 66.7151 3.0413 16.7449 10.1628 2.1181 6.0759 166.7410 8.0844 46.3348 60.7184 29.3886 47.9715 13.3526 9.6492 41.6799 14.8481 16.5305 47.6285 21.6587 26.9760 28.8266 29.0075 9.9869 11.0472 10.3576 4.5305 2.0385 8.0704 1.7960
temp: 298.150 k
press: 1.00000 atm
elementType: 35 8 8 6 6 6 6 6 6 6 6 6 6 6 6 6 6 6 6 6 1 1 1 1 1 1 1 1 1 1 1 1 1 1 1 1 1 1 1 1 1
symmnumber: 1
zpe: 874328.2 jmol-1
zpe.correction: 0.333014 hartree
zpe.thermalcorrener: 0.355232 hartree
zpe.thermalcorrenthalpy: 0.356176 hartree
zpe.thermalcorrgfe: 0.277398 hartree
zpe.sumelectzpe: -822.787772 hartree
zpe.sumelectthermal: -822.765555 hartree
zpe.sumelectthermalent: -822.764610 hartree
zpe.sumelectthermalfe: -822.843388 hartree
dipole: 2.7078 -0.2575 -0.6485
dipole: 2.7963
quadrupole: -130.4604 -127.4513 -124.7146
quadrupole: -3.3550 -9.6998 -6.6600
quadrupole: -2.9183 0.0908 2.8274 -3.3550 -9.6998 -6.6600
hfenergy: -823.1207862 hartree
pointgroup: C01 [X(C17H21Br1O2)]
dipole: 1.0703947 0.2507117 -0.0412508 debye
polarizability: 302.0088541|-3.9757485|189.0676771|24.427448|-1.262326|161.9279841 unknown
InChI: InChI=1S/C17H21BrO2/c1-11(2)9-14-15(17(14,3)4)16(19)20-10-12-5-7-13(18)8-6-12/h5-9,14-15H,10H2,1-4H3
charge 0 multiplicity 1
41 atoms
Br -7.108733 -0.027881 -2.09892
O  -0.552956 -0.206804 0.215153
O  0.862219 -1.018594 1.885911
C  2.480956 1.69294 1.321737
C  3.129378 0.5382 0.543686
C  1.585365 0.800518 0.402106
C  2.374707 1.558298 2.839438
C  2.680832 3.132492 0.847556
C  4.024939 0.723224 -0.62625
C  0.656799 -0.216896 0.938002
C  5.022462 -0.119099 -1.032605
C  5.866732 0.215437 -2.25136
C  5.389457 -1.423222 -0.34722
C  -1.562531 -1.208334 0.649865
C  -2.869963 -0.909122 -0.051811
C  -3.231228 0.410636 -0.416054
C  -3.778813 -1.964138 -0.311046
C  -4.478924 0.678263 -1.022479
C  -5.034182 -1.714175 -0.909667
C  -5.368265 -0.39002 -1.25774
H  3.330785 -0.339661 1.16831
H  1.247563 1.268602 -0.526682
H  2.189162 0.516531 3.148617
H  3.314852 1.902577 3.310301
H  1.550549 2.184111 3.231833
H  3.657588 3.518525 1.195486
H  2.65182 3.229927 -0.251491
H  1.889542 3.784181 1.262103
H  3.861761 1.634548 -1.220185
H  6.939995 0.289926 -1.984104
H  5.787876 -0.579962 -3.019325
H  5.562208 1.17026 -2.71395
H  5.317392 -2.267855 -1.060878
H  6.440784 -1.396577 0.002645
H  4.750766 -1.660981 0.518198
H  -1.658346 -1.144532 1.751183
H  -1.191141 -2.220991 0.407976
H  -2.525183 1.22743 -0.240428
H  -3.513388 -2.995311 -0.048205
H  -4.749849 1.699195 -1.30641
H  -5.729488 -2.535068 -1.105895
