program: Gaussian 09
title: 000158119
version: EM64L-G09RevD.01
frameworkgroup: C1[X(C17H21IO2)]
method: RPBEPBE
basis: SDD
operation: Freq
keyword: #p
keyword: freq=noraman
keyword: PBEPBE/SDD
title: #p freq=noraman PBEPBE/SDD
converged: YES YES NO NO
title: Mulliken charges:
elementType: I O O C C C C C C C C C C C C C C C C C H H H H H H H H H H H H H H H H H H H H H
charge: 0.093308 -0.273997 -0.272228 0.311203 -0.269606 -0.385046 -0.747324 -0.735362 -0.262507 0.261901 0.358774 -0.790971 -0.793957 -0.425233 0.489110 -0.318007 -0.378240 -0.322196 -0.209937 -0.181708 0.258281 0.266623 0.262141 0.213078 0.208508 0.221139 0.213162 0.223075 0.196535 0.217593 0.217799 0.227984 0.221207 0.220307 0.236142 0.230990 0.233691 0.253964 0.241453 0.235744 0.252609
chargesum: 0.00000
title: Mulliken charges with hydrogens summed into heavy atoms:
elementType: I O O C C C C C C C C C C C C C C C C C
charge: 0.093308 -0.273997 -0.272228 0.311203 -0.011325 -0.118423 -0.063597 -0.077986 -0.065971 0.261901 0.358774 -0.127595 -0.116301 0.039448 0.489110 -0.064042 -0.136788 -0.322196 0.025807 0.070900
polarizability: 3.08001365e+02 -3.51957433e+01 2.16167009e+02 -1.46176785e+01 -4.76613717e+00 1.52013722e+02
1716.lowfreq: -9.2676 -6.9173 -2.3309 0.0002 0.0003 0.0005 2.8437 7.9282 23.0673
frequency: -7.4360 6.7119 23.0504 38.7720 48.1951 78.0311 87.9010 111.2605 129.2522 131.8259 141.8443 151.1239 173.0535 180.7529 184.6955 212.8416 218.7591 230.5680 255.1103 266.9882 286.4274 315.6576 335.9229 355.1649 366.4053 407.9074 417.7183 435.9426 458.4988 499.0355 511.1763 530.1475 574.4525 625.3807 645.2007 687.0667 717.2786 727.9396 786.1545 806.6851 819.8138 849.7425 858.8386 864.3697 885.8241 907.6997 922.4227 947.4949 950.8520 954.8808 964.5352 978.3108 982.9481 983.9621 992.1681 1011.2873 1036.5687 1053.4254 1061.7623 1076.0175 1082.1343 1100.2244 1111.9300 1125.4494 1165.6271 1182.3264 1186.5759 1196.7270 1221.8544 1242.4517 1287.3120 1296.9626 1323.7089 1343.4820 1371.3934 1372.1858 1387.9315 1390.5473 1400.1280 1402.2436 1412.3064 1420.1735 1455.1654 1462.6595 1463.0440 1467.0092 1471.0801 1471.2554 1472.5057 1476.5870 1483.0356 1489.7123 1571.1189 1602.4393 1614.3802 1685.3702 2956.9975 2965.5247 2974.3631 2978.6178 3013.9846 3027.7335 3032.4188 3058.2790 3066.5931 3076.8888 3078.2489 3082.0993 3092.7105 3096.1554 3097.1692 3121.8820 3133.7626 3151.2714 3151.9778 3154.6270 3172.7863
redmass: 6.4679 5.3245 4.2000 3.5793 3.9345 4.6205 2.9935 1.1509 3.7698 3.6587 3.5026 3.8424 1.5021 1.2794 1.6184 3.1365 2.8275 1.6555 5.9853 3.9678 3.4288 3.4025 2.9320 2.5505 2.5896 3.1650 2.4804 3.1037 2.5878 2.9745 3.2538 4.6230 6.1910 4.1941 7.0309 2.6841 4.4513 5.4869 1.6061 3.2331 3.5975 3.8051 2.0850 2.3818 3.0144 1.5388 1.6722 1.7388 1.4697 1.6282 1.8033 1.5866 2.7512 1.7889 1.2528 1.5998 1.7566 1.6962 2.3066 1.4040 1.5590 1.5450 2.2356 1.8307 2.5729 1.0898 1.0926 2.0816 2.0662 2.4165 1.7638 1.2730 1.6521 1.5462 2.0081 4.8405 1.2319 1.2886 1.2528 1.2619 2.5003 2.1791 1.0496 1.0886 2.3576 1.0528 1.0580 1.0856 1.0456 1.0826 1.1303 1.0721 6.5103 6.5698 9.8021 6.3249 1.0373 1.0390 1.0368 1.0363 1.0577 1.0968 1.0963 1.0989 1.0988 1.1076 1.0982 1.0978 1.0890 1.0985 1.0961 1.0876 1.0873 1.0890 1.0932 1.0930 1.0984
irintensity: 0.1199 0.1129 0.5534 0.3621 0.7958 1.2566 0.4379 0.2163 0.4711 0.1839 0.2575 0.6705 0.5931 1.5306 2.1432 0.4124 4.5382 3.7839 1.3160 10.4069 4.8169 1.1095 0.9782 0.1969 0.3018 7.6071 1.4814 5.3288 3.6378 14.2990 7.1506 1.6041 9.2119 5.3903 22.1660 22.1996 32.3331 18.5514 88.1633 18.8729 4.0285 17.4568 32.7692 5.0908 42.9958 8.2068 4.7151 22.8633 7.4246 0.9153 17.9875 74.7661 9.3194 4.5068 2.3374 28.2677 44.0236 51.2972 26.5044 6.8528 5.9037 4.4558 552.3693 3.2218 58.6002 0.2461 1.7713 67.0427 24.5018 44.9628 59.5551 0.1276 27.3839 27.4538 52.5500 16.3504 10.2150 43.6270 15.3299 18.0490 24.6691 67.5757 1.3506 19.6327 18.5926 6.5902 8.0808 2.5261 24.7095 2.3258 21.8244 9.6630 55.4036 19.0690 168.5656 7.4443 48.6074 62.1387 29.4987 47.5775 19.6204 11.6844 40.6513 16.8529 45.4304 11.9492 22.1387 27.8608 27.7492 7.7563 31.1192 11.8512 5.0842 3.9340 10.4181 4.4899 10.7074
temp: 298.150 k
press: 1.00000 atm
elementType: 53 8 8 6 6 6 6 6 6 6 6 6 6 6 6 6 6 6 6 6 1 1 1 1 1 1 1 1 1 1 1 1 1 1 1 1 1 1 1 1 1
symmnumber: 1
zpe: 873016.5 jmol-1
zpe.correction: 0.332514 hartree
zpe.thermalcorrener: 0.353986 hartree
zpe.thermalcorrenthalpy: 0.354930 hartree
zpe.thermalcorrgfe: 0.278293 hartree
zpe.sumelectzpe: -820.833808 hartree
zpe.sumelectthermal: -820.812337 hartree
zpe.sumelectthermalent: -820.811393 hartree
zpe.sumelectthermalfe: -820.888030 hartree
dipole: -1.7044 1.2654 -1.2787
dipole: 2.4781
quadrupole: -127.1339 -122.1919 -138.9373
quadrupole: 1.6178 5.0324 -0.1081
quadrupole: 2.2872 7.2291 -9.5163 1.6178 5.0324 -0.1081
hfenergy: -821.1663227 hartree
pointgroup: C01 [X(C17H21I1O2)]
dipole: 0.7072506 -0.4096932 -0.5315219 debye
polarizability: 304.2171215|-40.3087758|213.7725464|20.0702765|12.7401802|158.1924278 unknown
InChI: InChI=1S/C17H21IO2/c1-11(2)8-14-15(17(14,3)4)16(19)20-10-12-6-5-7-13(18)9-12/h5-9,14-15H,10H2,1-4H3
charge 0 multiplicity 1
41 atoms
I  -6.689379 1.176957 -0.978403
O  -0.709646 0.062073 0.26784
O  0.669336 0.188058 2.149705
C  2.393668 2.146245 0.281627
C  3.00458 0.73613 0.248985
C  1.474816 0.926416 -0.051581
C  2.269421 2.836126 1.638583
C  2.649915 3.112294 -0.875216
C  3.918245 0.252119 -0.816988
C  0.499511 0.37895 0.916804
C  4.898365 -0.692478 -0.688136
C  5.765679 -1.074093 -1.87656
C  5.22174 -1.436289 0.595385
C  -1.773562 -0.515113 1.157961
C  -2.950688 -0.863086 0.280393
C  -4.004416 0.07024 0.107186
C  -3.015774 -2.113855 -0.382067
C  -5.09662 -0.255711 -0.723186
C  -4.114771 -2.426482 -1.210209
C  -5.168458 -1.498556 -1.388579
H  3.168139 0.317694 1.248932
H  1.158405 0.84507 -1.095191
H  2.039797 2.119781 2.444411
H  3.218245 3.349495 1.884092
H  1.467354 3.59854 1.618693
H  3.630363 3.609501 -0.749688
H  2.648189 2.612897 -1.859494
H  1.870084 3.895892 -0.896645
H  3.785126 0.70833 -1.809051
H  6.837085 -0.884083 -1.664502
H  5.67653 -2.155718 -2.102509
H  5.492069 -0.510622 -2.785518
H  5.118337 -2.529391 0.444718
H  6.274164 -1.258686 0.894002
H  4.577037 -1.152459 1.442196
H  -2.025562 0.238946 1.924405
H  -1.350761 -1.398651 1.668638
H  -3.960256 1.039271 0.614352
H  -2.203404 -2.837822 -0.251364
H  -4.163089 -3.393955 -1.721197
H  -6.020713 -1.743776 -2.028523
