program: Gaussian 09
title: 000158146
version: EM64L-G09RevD.01
frameworkgroup: C1[X(C21H24O8)]
method: RPBEPBE
basis: SDD
operation: Freq
keyword: #pfreq=noraman
keyword: PBEPBE/SDD
title: #p freq=noraman PBEPBE/SDD
converged: YES YES NO NO
title: Mulliken charges:
elementType: O O O O O O O O C C C C C C C C C C C C C C C C C C C C C H H H H H H H H H H H H H H H H H H H H H H H H
charge: -0.284494 -0.234563 -0.316203 -0.291014 -0.217191 -0.208470 -0.232419 -0.220743 -0.216198 -0.091399 -0.097824 -0.160193 0.197603 -0.442334 -0.207487 0.286710 0.373113 0.153191 -0.739507 -0.490787 0.083011 -0.717352 -0.669473 0.190668 0.309175 0.357762 -0.756163 -0.772728 -0.626416 0.287018 0.288769 0.270284 0.313540 0.245483 0.231990 0.243021 0.240985 0.261593 0.237652 0.281726 0.235133 0.228913 0.224818 0.227265 0.261638 0.251568 0.248042 0.254174 0.274118 0.224593 0.219728 0.232396 0.257276
chargesum: 0.00000
title: Mulliken charges with hydrogens summed into heavy atoms:
elementType: O O O O O O O O C C C C C C C C C C C C C C C C C C C C C
charge: -0.284494 -0.234563 -0.316203 -0.291014 -0.217191 -0.208470 -0.232419 -0.220743 0.070819 0.197370 0.172460 0.153347 0.197603 0.035139 0.035534 0.286710 0.373113 0.153191 0.000723 -0.209061 0.083011 -0.028489 -0.180570 0.190668 0.309175 0.357762 -0.002378 -0.054288 -0.136744
polarizability: 2.45527283e+02 -1.37543931e+01 2.51020347e+02 -1.13965630e+01 -4.01920120e+00 2.43652884e+02
1716.lowfreq: -8.1865 -3.9898 0.0006 0.0008 0.0009 5.4003 14.1876 29.1178 33.4098
frequency: 13.9268 29.0426 33.3921 38.9833 43.3856 46.9363 48.3907 61.1517 64.3901 78.9329 98.7361 103.7610 129.9916 142.7555 158.6559 167.5996 186.6953 187.3890 193.2358 208.2683 215.0057 220.2588 236.8524 243.4245 259.2137 270.5873 289.1693 297.8514 324.9178 334.9847 339.5585 374.6085 384.8547 391.5042 402.5219 414.5835 454.6470 484.0626 510.6295 519.5697 530.7083 557.4386 570.1053 577.3492 579.3151 587.4098 601.7341 617.5094 627.4334 643.6445 650.1284 690.0383 707.4686 731.5168 752.1349 775.5974 778.8454 785.9368 807.2052 826.1078 826.7813 831.5606 858.8324 881.6771 896.9476 913.8395 924.9242 932.9489 943.9659 946.9776 959.8396 979.5453 988.6643 990.8320 992.9657 1006.8571 1014.7805 1019.6104 1040.7783 1045.6081 1059.9673 1062.4996 1068.0778 1071.0300 1100.9167 1110.5774 1113.3813 1133.7487 1151.9123 1178.6246 1185.7648 1201.6242 1203.9608 1215.1272 1236.0266 1254.7446 1264.8933 1278.9868 1288.5022 1293.9194 1305.8661 1315.2400 1324.3122 1344.6789 1356.0507 1361.9234 1383.3799 1385.7330 1393.2569 1399.0107 1399.8062 1416.6106 1416.6978 1451.2115 1454.1051 1459.7204 1460.0582 1460.7266 1475.3904 1476.4831 1479.8411 1482.7336 1594.1134 1621.1691 1630.4624 1651.7386 1667.4565 1671.2899 1683.3505 2984.2160 2986.5706 2988.2386 3005.2393 3008.4683 3011.0799 3015.8030 3022.0782 3036.4851 3058.5861 3069.3173 3077.8612 3083.7186 3092.2556 3095.2049 3097.2564 3098.5316 3107.0235 3108.2276 3115.2705 3145.8207 3207.4260 3219.1576 3232.9379
redmass: 4.5367 6.2264 2.0766 2.2000 3.1399 5.8424 4.5354 4.3643 4.3983 3.2923 4.1063 6.5568 6.0762 4.7169 4.0155 6.3927 4.6500 4.3601 1.1208 1.9876 2.5999 3.1937 3.3098 1.2158 3.1308 3.1689 3.9315 3.3686 3.1073 4.8433 4.6397 3.7184 3.7110 3.9118 3.1398 4.0753 4.3439 4.3033 4.3790 4.6559 4.1274 3.3265 4.4624 5.3149 3.5100 5.3701 3.9079 5.0286 1.6377 4.2730 3.5784 4.2147 3.7462 3.5387 4.3681 2.3496 2.1393 3.2806 4.2801 4.5666 1.8326 2.7064 4.0057 3.1519 2.7789 3.0099 3.3516 2.7444 2.9393 2.9700 2.3708 1.4303 2.1682 2.0155 1.3245 3.5015 1.4368 1.9866 1.6574 3.5870 2.5625 1.5108 2.2376 3.2319 2.5961 3.5242 2.2149 2.3991 2.4277 3.1295 3.0966 2.1688 1.4655 1.3778 1.6732 2.4033 2.0552 1.4754 2.0146 1.4962 1.4225 1.2751 1.3201 1.5285 1.5526 1.5575 1.2242 1.2365 1.2643 1.1743 1.2035 1.1735 1.2482 1.0587 1.0471 1.0491 1.0781 1.0564 1.0493 1.0594 1.0547 1.0477 7.8521 10.0913 11.3165 5.3851 6.7844 9.4387 11.7225 1.0363 1.0810 1.0363 1.0350 1.0371 1.0830 1.0618 1.0834 1.0833 1.0869 1.0978 1.1025 1.1003 1.0997 1.0970 1.1001 1.0621 1.0619 1.1005 1.1009 1.1009 1.1154 1.1158 1.0981
irintensity: 0.4595 1.9412 0.2444 2.3912 2.1236 0.5152 1.2959 1.9042 3.6625 0.4840 0.8686 0.4176 1.9465 5.8698 2.2057 0.6620 1.5788 0.8966 1.3676 1.6967 3.4403 2.4806 2.9709 0.0492 2.1985 6.1764 1.8728 2.9782 0.8099 9.5127 1.2148 13.2155 4.8373 3.7334 5.5826 2.2456 5.9624 11.9834 5.0497 6.1694 5.5428 3.2322 2.1835 3.5235 5.3108 5.7223 13.5458 8.6247 9.8331 1.8474 10.7529 1.0369 4.3908 4.1048 10.3323 3.1359 4.5632 10.7800 28.1044 48.1930 48.1318 6.6760 6.4616 12.5739 9.7690 57.0473 51.7276 19.1322 62.7061 81.2244 37.5890 42.0011 53.7244 91.7768 52.4303 70.9966 18.7607 19.0179 4.2607 136.3774 70.5491 14.7371 77.8361 345.1202 22.0157 11.9813 2.4440 19.9204 23.9976 277.9725 67.6483 9.0861 2.2704 35.1336 62.8258 18.7743 62.9026 22.1656 36.4789 41.4173 4.2897 6.5109 14.0282 10.5191 7.6131 12.0215 10.7229 53.5396 14.5069 8.5636 26.4887 31.2772 10.1258 23.1849 22.8054 17.0536 2.9438 17.5522 10.5297 50.8645 8.8269 15.8776 252.8247 107.2164 140.5480 3.9089 65.4733 171.1174 268.2877 12.3960 5.9607 18.2338 10.8010 1.3625 8.7169 19.4602 10.0267 0.3664 6.5534 12.8019 18.6642 28.6048 25.5087 5.9691 26.1194 4.5498 4.4572 14.0121 5.8953 8.7629 3.0151 4.2094 0.4430
temp: 298.150 k
press: 1.00000 atm
elementType: 8 8 8 8 8 8 8 8 6 6 6 6 6 6 6 6 6 6 6 6 6 6 6 6 6 6 6 6 6 1 1 1 1 1 1 1 1 1 1 1 1 1 1 1 1 1 1 1 1 1 1 1 1
symmnumber: 1
zpe: 1084196.3 jmol-1
zpe.correction: 0.412949 hartree
zpe.thermalcorrener: 0.442160 hartree
zpe.thermalcorrenthalpy: 0.443104 hartree
zpe.thermalcorrgfe: 0.351012 hartree
zpe.sumelectzpe: -1414.228047 hartree
zpe.sumelectthermal: -1414.198836 hartree
zpe.sumelectthermalent: -1414.197892 hartree
zpe.sumelectthermalfe: -1414.289983 hartree
dipole: -1.3336 -1.0046 -4.9821
dipole: 5.2544
quadrupole: -183.4869 -174.9673 -160.8055
quadrupole: -34.9592 6.0009 -1.7903
quadrupole: -10.4003 -1.8807 12.2810 -34.9592 6.0009 -1.7903
hfenergy: -1414.6409955 hartree
pointgroup: C01 [X(C21H24O8)]
dipole: 0.1124205 0.4375634 -2.0172808 debye
polarizability: 248.4216133|8.5754614|258.4956278|9.4412331|-5.1138689|233.2832732 unknown
InChI: InChI=1S/C21H24O8/c1-9(2)19(24)28-17-16-11(4)20(25)27-14(16)7-10(3)13-8-15(23)21(6,29-13)18(17)26-12(5)22/h8,10,14,16-18H,1,4,7H2,2-3,5-6H3
charge 0 multiplicity 1
53 atoms
O  0.258116 0.502772 -2.214926
O  -2.137597 2.553151 1.040431
O  0.637122 0.052703 1.2988
O  -0.791588 -2.175276 -1.301296
O  3.335067 -0.54704 -0.596527
O  -3.947917 1.958362 2.374754
O  0.47329 -1.662233 2.884448
O  0.394175 -4.180454 -1.059677
C  -1.533653 0.364117 0.080274
C  -0.395947 -0.631979 0.486457
C  -1.180108 1.9008 0.082567
C  0.315012 -1.413215 -0.653821
C  1.109143 -0.636766 -1.729695
C  -1.327592 2.641056 -1.271645
C  0.03481 2.914127 -2.007219
C  -2.729678 0.271499 1.022029
C  0.900221 1.694751 -1.853227
C  2.365349 0.071412 -1.116946
C  1.503661 -1.503298 -2.930319
C  2.138264 1.503553 -1.279187
C  -3.053973 1.623459 1.576868
C  0.734346 4.189871 -1.490825
C  -3.455854 -0.821885 1.360248
C  1.018792 -0.600922 2.505879
C  -0.634158 -3.578262 -1.422993
C  2.106048 0.151162 3.205451
C  -1.872501 -4.17805 -2.046719
C  2.767795 1.31915 2.50649
C  2.453237 -0.290471 4.446776
H  -1.844614 0.068867 -0.93685
H  -0.83994 -1.417598 1.125761
H  -0.184121 2.06801 0.524292
H  1.021891 -2.135848 -0.198095
H  -1.800679 3.618208 -1.067717
H  -2.004873 2.075738 -1.935648
H  -0.19709 3.044767 -3.08358
H  2.088911 -0.908043 -3.650888
H  2.124562 -2.347038 -2.584554
H  0.606851 -1.892328 -3.439273
H  2.812913 2.281421 -0.929563
H  0.098373 5.070939 -1.682986
H  0.915789 4.13799 -0.401763
H  1.703437 4.35426 -1.995007
H  -3.234987 -1.819462 0.964614
H  -4.294537 -0.721039 2.058403
H  -2.040063 -3.747286 -3.049254
H  -2.761238 -3.940273 -1.437002
H  -1.756793 -5.268168 -2.125684
H  3.26162 0.980342 1.577437
H  2.027037 2.089162 2.224724
H  3.526122 1.781994 3.159812
H  3.242139 0.202518 5.024463
H  1.950907 -1.154528 4.894706
