program: Gaussian 09
title: 000158089
version: EM64L-G09RevD.01
frameworkgroup: C1[X(C19H19NO4)]
method: RPBEPBE
basis: SDD
operation: Freq
keyword: #p
keyword: freq=noraman
keyword: PBEPBE/SDD
title: #p freq=noraman PBEPBE/SDD
converged: YES YES NO NO
title: Mulliken charges:
elementType: O O O O N C C C C C C C C C C C C C C C C C C C H H H H H H H H H H H H H H H H H H H
charge: -0.418076 -0.290540 -0.262310 -0.288086 -0.090434 -0.181985 0.086331 -0.347155 0.413409 0.163912 -0.409246 -0.534268 0.168476 0.228898 -0.015066 -0.594257 0.173577 -0.660308 0.164850 -0.403056 -0.398717 -0.247925 -0.199517 -0.532562 0.206235 0.250061 0.211687 0.186191 0.240481 0.205662 0.258991 0.262849 0.182918 0.217806 0.286153 0.345317 0.240390 0.224184 0.237695 0.228375 0.244159 0.221777 0.223124
chargesum: 0.00000
title: Mulliken charges with hydrogens summed into heavy atoms:
elementType: O O O O N C C C C C C C C C C C C C C C C C C C
charge: -0.072759 -0.290540 -0.262310 -0.288086 -0.090434 0.024250 0.086331 -0.097094 0.413409 0.163912 -0.011367 -0.088124 0.168476 0.228898 -0.015066 -0.335267 0.173577 0.003264 0.164850 -0.116902 -0.158327 -0.023741 0.266553 0.156498
polarizability: 3.05045764e+02 4.31531143e+00 2.67974233e+02 4.28306184e+00 5.46626088e+00 1.25838498e+02
1716.lowfreq: -3.6969 0.0002 0.0006 0.0006 2.9965 9.0842 36.5078 42.5934 53.0780
frequency: 36.5015 42.5755 53.0657 98.6990 101.1098 106.6331 129.2087 145.2029 163.4283 188.1508 195.4968 208.1944 223.1131 229.3626 263.7612 285.0631 289.4051 300.6212 305.5234 316.8483 325.3135 353.6926 360.3869 379.0051 408.8190 466.1068 478.3058 488.7473 505.9069 540.0808 550.0756 570.3624 610.9406 629.8609 642.8450 684.0901 686.3224 706.4444 719.5125 743.7858 749.4988 781.6756 786.0458 799.5621 820.2184 841.5064 862.3683 871.9259 884.9006 908.1508 935.5893 949.0090 962.8336 974.9342 985.8177 1017.4277 1027.7261 1059.8599 1072.2238 1075.5988 1077.5772 1088.2482 1109.5359 1113.5932 1132.8463 1142.0469 1152.2714 1168.9896 1179.0907 1186.6797 1188.9108 1201.5896 1219.8508 1227.5382 1241.0233 1246.3921 1267.0836 1294.2150 1304.5989 1328.2069 1331.1942 1343.4270 1358.9634 1366.1985 1371.9787 1394.2137 1404.7401 1422.9355 1432.9885 1435.9368 1439.3978 1446.6929 1462.1793 1466.0385 1467.5925 1475.1422 1477.9041 1479.4991 1486.8555 1488.3826 1584.0477 1607.4398 1611.8721 1632.1166 2723.9209 2823.9166 2845.6303 2962.0429 2978.7243 2986.0640 3016.6759 3030.0880 3032.2726 3038.0942 3050.7342 3085.1497 3112.4388 3123.2994 3135.8074 3163.8630 3165.8561 3190.2300 3546.9616
redmass: 3.9533 4.6195 3.5902 4.3989 4.3373 2.8324 4.2525 3.7237 3.5892 5.2032 2.2317 3.2923 2.0457 2.4187 1.5274 2.2963 2.6085 1.8814 2.6336 2.7926 4.3587 5.0160 4.9569 5.0053 3.9065 3.5905 6.1727 3.4386 4.9667 4.4338 3.7049 4.6828 6.0471 5.1060 6.3398 3.4073 8.2301 6.6716 6.1457 2.2363 4.2615 3.9376 5.4837 3.0432 3.1319 6.6303 3.3627 1.6584 1.4266 4.4124 5.9995 2.6941 4.1875 1.3277 6.1023 3.5093 2.6314 3.1409 2.0211 2.4567 1.5283 2.0810 1.3534 1.2599 1.2940 2.0305 1.4027 1.8747 1.3349 1.2579 1.5642 1.6226 1.7166 3.0027 2.3287 1.8407 2.1239 1.9558 1.4772 1.7509 1.5988 1.8486 1.3974 1.4476 1.6163 3.5201 4.4355 2.8933 1.3662 1.5502 1.9078 1.3378 2.2173 1.0707 1.0520 1.3553 1.1164 1.1602 1.4806 1.3655 6.6312 7.0845 8.6794 10.0271 1.0756 1.0689 1.0604 1.0326 1.0595 1.0633 1.0837 1.0735 1.0958 1.0910 1.1040 1.1005 1.1070 1.0998 1.0877 1.0930 1.0937 1.0948 1.0659
irintensity: 0.1912 0.3605 1.2057 9.0842 1.2137 6.5250 2.9703 6.0069 7.8768 3.0651 0.0891 0.2349 0.7297 0.6572 0.8844 1.1378 15.7647 63.2877 22.5401 19.7593 10.9110 1.8431 1.3298 5.3522 2.1781 1.8042 6.1047 2.3192 5.1370 0.7685 0.5965 11.3238 10.1398 4.2442 4.7742 4.8944 2.1184 7.1115 11.0920 19.4057 17.3507 74.7937 18.6249 11.2944 6.1864 35.0897 29.8706 23.5106 1.1791 5.9724 20.3782 4.8890 15.1841 1.0176 177.1360 14.5754 54.5144 16.7785 13.1968 43.6351 10.2939 15.8470 4.9344 0.1753 10.2101 43.7584 3.7020 2.8482 30.0416 1.0671 32.9632 21.5590 40.0871 231.0382 6.8014 8.2263 68.2153 15.3873 12.4448 21.0013 14.4953 10.8274 3.3531 4.0703 29.1955 20.9058 93.4752 12.0817 3.9820 14.6362 16.9989 22.3670 24.9652 13.8778 11.5387 4.4469 16.8296 14.7388 62.3305 12.0030 78.9007 36.2225 6.3254 6.4474 65.0890 74.7214 190.2653 79.5994 35.8275 134.9695 28.0997 33.8557 36.4928 61.0187 44.0235 28.2785 30.2429 22.5288 11.5780 4.2443 16.6039 6.1441 6.5098
temp: 298.150 k
press: 1.00000 atm
elementType: 8 8 8 8 7 6 6 6 6 6 6 6 6 6 6 6 6 6 6 6 6 6 6 6 1 1 1 1 1 1 1 1 1 1 1 1 1 1 1 1 1 1 1
symmnumber: 1
zpe: 895819.0 jmol-1
zpe.correction: 0.341199 hartree
zpe.thermalcorrener: 0.361829 hartree
zpe.thermalcorrenthalpy: 0.362773 hartree
zpe.thermalcorrgfe: 0.292716 hartree
zpe.sumelectzpe: -1089.286288 hartree
zpe.sumelectthermal: -1089.265659 hartree
zpe.sumelectthermalent: -1089.264715 hartree
zpe.sumelectthermalfe: -1089.334771 hartree
dipole: -3.0502 -1.2981 -1.0392
dipole: 3.4740
quadrupole: -113.6053 -123.7733 -143.9563
quadrupole: 2.7004 0.1867 -5.7862
quadrupole: 13.5064 3.3383 -16.8447 2.7004 0.1867 -5.7862
hfenergy: -1089.6274875 hartree
pointgroup: C01 [X(C19H19N1O4)]
dipole: 1.199796 0.4738749 -0.4517299 debye
polarizability: 304.9060026|3.2292866|267.3128903|-8.5043772|-10.1287287|126.6396021 unknown
InChI: InChI=1S/C19H19NO4/c1-20-7-6-10-8-13-19(24-9-23-13)16-11-4-3-5-12(22-2)15(11)18(21)17(20)14(10)16/h3-5,8,17-18,21H,6-7,9H2,1-2H3
charge 0 multiplicity 1
43 atoms
O  1.437574 -1.342817 1.708639
O  -2.104116 2.687577 -0.120963
O  -4.241494 1.672155 0.189032
O  4.04768 -0.04767 0.094781
N  0.055353 -3.204365 -0.037238
C  0.276104 -1.792983 -0.416852
C  -0.965056 -0.927149 -0.184855
C  1.533912 -1.189586 0.238368
C  -2.240377 -1.515246 -0.005313
C  -0.793043 0.501779 -0.234158
C  -1.194398 -3.727856 -0.624493
C  -2.390781 -3.028013 0.038959
C  1.692061 0.268366 -0.159543
C  0.556534 1.094273 -0.392561
C  -1.964452 1.26575 -0.084099
C  -3.402394 -0.703698 0.141976
C  -3.228816 0.675516 0.1043
C  1.225407 -4.071958 -0.24612
C  2.993901 0.834595 -0.233601
C  0.751453 2.460515 -0.745199
C  3.187787 2.188282 -0.590705
C  2.050993 2.987401 -0.849993
C  -3.496656 2.943177 0.328096
C  5.416973 0.458098 -0.018248
H  0.501875 -1.728652 -1.524105
H  2.424166 -1.738806 -0.120078
H  -1.242585 -4.81549 -0.434901
H  -1.234588 -3.579937 -1.736568
H  -2.445872 -3.360808 1.093618
H  -3.334395 -3.330895 -0.455265
H  -4.391458 -1.149796 0.277941
H  2.034596 -3.787439 0.446924
H  1.625879 -4.044735 -1.293005
H  0.942772 -5.114131 -0.016168
H  -0.112169 3.101302 -0.930347
H  2.256065 -0.932873 2.091269
H  4.189184 2.621733 -0.664002
H  2.187297 4.037962 -1.129709
H  -3.94901 3.702088 -0.327434
H  -3.479907 3.242997 1.394483
H  6.061009 -0.390601 0.255851
H  5.594033 1.300707 0.678045
H  5.642156 0.779232 -1.053555
