program: Gaussian 09
title: 000155011
version: EM64L-G09RevD.01
frameworkgroup: C1[X(C17H14O7)]
method: RPBEPBE
basis: SDD
operation: Freq
keyword: #pfreq=noraman
keyword: PBEPBE/SDD
title: #p freq=noraman PBEPBE/SDD
converged: YES YES NO NO
title: Mulliken charges:
elementType: O O O O O O O C C C C C C C C C C C C C C C C C H H H H H H H H H H H H H H
charge: -0.330919 -0.369696 -0.198014 -0.423122 -0.326448 -0.399677 -0.402409 0.259813 0.271557 0.075080 0.397619 0.053444 -0.309483 0.076538 -0.638293 0.417490 0.096431 -0.043600 -0.599645 0.035865 0.185942 -0.786898 -0.512731 -0.505814 0.300154 0.315472 0.227443 0.246851 0.244751 0.391391 0.386459 0.216559 0.293540 0.232040 0.385853 0.232009 0.284333 0.220114
chargesum: 0.00000
title: Mulliken charges with hydrogens summed into heavy atoms:
elementType: O O O O O O O C C C C C C C C C C C C C C C C C
charge: -0.330919 -0.369696 -0.198014 -0.031731 -0.326448 -0.013218 -0.016556 0.259813 0.271557 0.075080 0.397619 0.053444 -0.309483 0.076538 -0.338139 0.417490 0.096431 -0.043600 -0.284173 0.035865 0.185942 -0.067852 0.229408 0.230642
polarizability: 4.09051942e+02 3.23547558e+00 2.59262133e+02 -1.81086888e+00 -4.47662222e+00 9.68644425e+01
1716.lowfreq: -6.9008 -5.7702 -0.0008 -0.0005 0.0004 2.8064 34.3106 38.1879 60.2129
frequency: 34.3013 38.1828 60.2022 77.9501 94.8089 95.5486 111.3803 120.1322 130.3895 149.4847 157.4818 174.0619 185.6016 210.4023 236.9667 247.6713 258.8585 275.2076 291.5696 311.8272 321.7752 331.8126 337.1138 356.7933 382.5051 404.0109 421.8545 452.5472 461.4163 487.1990 512.2266 524.5004 563.0088 581.0248 585.9124 594.0083 601.1743 617.8878 627.1672 658.5337 692.3880 704.1541 714.7389 744.0000 755.8279 776.6452 827.2759 836.4773 861.7516 912.8265 942.7938 952.3949 995.4370 1002.8683 1011.8044 1024.7060 1049.7411 1070.8473 1078.7582 1108.7818 1117.5948 1145.8919 1153.2046 1158.0427 1170.7721 1193.6913 1202.7555 1243.3269 1271.2100 1280.4296 1305.1315 1341.6815 1367.6506 1399.4585 1405.3338 1408.9070 1419.8827 1424.9131 1435.6788 1440.9616 1448.6953 1451.2502 1455.1659 1455.3571 1466.8927 1472.4476 1479.4906 1494.6589 1532.3302 1557.2247 1571.8551 1586.2887 1605.3216 1631.8465 2486.6169 2987.4318 2987.9587 2992.7703 3063.5767 3104.1873 3104.5162 3107.8170 3136.8888 3148.6257 3153.3777 3183.5164 3402.2218 3451.3908
redmass: 6.3655 3.9364 3.1311 1.0492 2.4868 3.0401 2.8329 6.3032 2.8230 2.4064 2.2630 5.0696 2.4655 4.0031 4.0640 6.4308 3.6882 5.6626 5.0139 6.1485 5.9125 6.1543 7.8120 7.6554 4.9447 7.8750 8.2212 6.4117 11.1876 7.6222 7.9286 7.9748 5.3689 4.7742 2.7908 6.1460 1.4147 6.3266 6.9857 1.1113 7.9647 5.9339 6.7620 7.6780 7.1877 6.8599 4.4481 6.0141 7.2653 1.5050 8.8972 1.5232 1.8272 1.0899 5.2885 4.5800 1.5515 7.4978 3.0269 1.2562 1.2471 1.9765 1.4069 2.1526 1.6785 1.8773 2.8818 2.1929 2.0139 3.1226 4.0261 5.0641 4.9822 1.4862 1.8621 2.5373 2.0948 4.6716 2.1223 2.0812 1.3986 1.9491 1.1523 1.0646 3.3592 1.4906 1.0550 1.0667 9.8658 3.9331 4.5915 7.2760 4.7218 4.6981 1.0760 1.0370 1.0321 1.0337 1.0964 1.1002 1.1006 1.0986 1.1052 1.1064 1.0918 1.0926 1.0626 1.0636
irintensity: 1.9593 1.1202 3.2938 0.1557 0.9500 5.8819 0.8475 3.4092 0.8177 0.7089 4.4366 0.4478 1.5341 4.0220 3.6063 0.0057 1.0625 0.4756 12.4909 1.9227 1.1595 5.2437 10.3834 0.9079 17.7429 3.9044 21.8694 8.8956 1.0710 1.3901 7.7334 0.8006 18.5651 15.5592 30.2636 28.1330 108.7054 3.4599 6.3835 127.8360 77.5676 21.0236 5.8341 2.7750 10.4991 4.2258 3.1806 3.5375 10.5796 10.8521 58.2315 15.4045 36.4267 133.1105 2.2580 19.3788 9.8091 86.1424 115.5495 48.5097 34.2011 93.4986 31.8691 24.1190 198.4257 42.6650 20.2181 15.2052 376.0901 182.3685 211.4985 369.0714 1007.9932 8.5681 10.9044 104.4954 7.5481 48.2960 33.8585 205.4546 5.8274 19.7133 16.4681 21.0475 12.4450 47.0911 28.8240 23.1180 315.4810 0.8685 37.0268 13.4620 27.2501 102.0219 283.8407 21.5125 70.4596 88.8931 11.7321 15.8384 23.4321 33.7829 6.5378 7.2514 3.1823 3.2897 98.2313 135.0372
temp: 298.150 k
press: 1.00000 atm
elementType: 8 8 8 8 8 8 8 6 6 6 6 6 6 6 6 6 6 6 6 6 6 6 6 6 1 1 1 1 1 1 1 1 1 1 1 1 1 1
symmnumber: 1
zpe: 727060.1 jmol-1
zpe.correction: 0.276923 hartree
zpe.thermalcorrener: 0.298802 hartree
zpe.thermalcorrenthalpy: 0.299746 hartree
zpe.thermalcorrgfe: 0.226429 hartree
zpe.sumelectzpe: -1181.066254 hartree
zpe.sumelectthermal: -1181.044374 hartree
zpe.sumelectthermalent: -1181.043430 hartree
zpe.sumelectthermalfe: -1181.116747 hartree
dipole: 0.0215 4.2085 2.2177
dipole: 4.7571
quadrupole: -114.9308 -142.3870 -138.9160
quadrupole: -6.2571 -1.3326 8.1146
quadrupole: 17.1471 -10.3090 -6.8381 -6.2571 -1.3326 8.1146
hfenergy: -1181.3431761 hartree
pointgroup: C01 [X(C17H14O7)]
dipole: -0.0326222 1.6030282 -0.9654585 debye
polarizability: 408.9252045|-2.750788|259.2146648|-7.1033705|-4.7972119|97.0386481 unknown
InChI: InChI=1S/C17H14O7/c1-6-4-7-11(17(24-3)12(6)19)14(21)10-8(13(7)20)5-9(18)16(23-2)15(10)22/h4-5,18-19,22H,1-3H3
charge 0 multiplicity 1
38 atoms
O  -2.884853 2.328238 -0.033402
O  0.013929 2.236214 0.125665
O  -0.232396 -3.277658 -0.171244
O  2.487756 2.193445 0.153912
O  4.932838 0.558637 0.04892
O  -5.051629 0.915219 0.168194
O  4.733924 -2.079103 -0.136058
C  -1.385547 0.257359 -0.054288
C  -1.425229 -1.182395 -0.057578
C  1.153528 0.143367 -0.029975
C  1.124208 -1.286173 -0.105102
C  -0.073777 0.934899 0.007238
C  -0.180908 -2.004261 -0.118012
C  -2.635125 0.942116 -0.027556
C  -2.655391 -1.873481 0.01523
C  -3.892927 -1.205878 0.108095
C  2.423476 0.826278 0.027341
C  -3.857739 0.209085 0.092387
C  2.315756 -2.027825 -0.140048
C  3.621254 0.067503 -0.039194
C  3.554163 -1.351499 -0.107358
C  -5.213877 -1.930598 0.205965
C  -2.382336 3.164896 -1.151115
C  5.280306 1.834302 -0.622987
H  -2.615205 -2.967528 0.009635
H  2.278286 -3.118516 -0.19083
H  -5.070258 -3.022853 0.184793
H  -5.743706 -1.659807 1.137695
H  -5.885602 -1.643904 -0.623943
H  1.482578 2.516045 0.190839
H  -4.809574 1.886756 0.164332
H  -2.57512 2.662656 -2.117311
H  -1.308544 3.351863 -1.007499
H  -2.9604 4.099002 -1.082799
H  5.493176 -1.432826 -0.086771
H  6.351178 1.975717 -0.415117
H  4.678866 2.656587 -0.210177
H  5.108523 1.746118 -1.711674
