program: Gaussian 09
title: 000013851
version: EM64L-G09RevD.01
frameworkgroup: C1[X(C4H3BrS)]
method: RPBEPBE
basis: SDD
operation: Freq
keyword: #p
keyword: freq=noraman
keyword: PBEPBE/SDD
title: #p freq=noraman PBEPBE/SDD
converged: NO YES NO NO
title: Mulliken charges:
elementType: Br S C C C C H H H
charge: 0.075645 0.331443 -0.040248 -0.122178 -0.513560 -0.518049 0.262643 0.252848 0.271456
chargesum: 0.00000
title: Mulliken charges with hydrogens summed into heavy atoms:
elementType: Br S C C C C
charge: 0.075645 0.331443 0.222395 0.130669 -0.513560 -0.246592
polarizability: 1.05116436e+02 2.69063620e+00 6.86509744e+01 8.23996819e-03 3.01145159e-04 2.50033024e+01
1716.lowfreq: -1.6230 -0.0013 0.0008 0.0025 3.5642 7.8114 177.6449 208.1361 313.5261
frequency: 177.6444 208.1359 313.5261 435.7994 548.1852 600.9983 673.6261 685.2119 800.6937 819.4870 901.3528 916.0531 1047.9861 1091.3669 1206.8499 1322.3109 1450.1477 1521.7858 3177.1239 3199.1872 3238.1250
redmass: 5.8916 10.3355 10.7830 5.6800 3.0317 11.5844 7.6561 1.1794 4.6710 1.2666 1.3523 6.4581 1.7551 1.0875 1.3708 2.1741 8.8030 5.2843 1.0904 1.0981 1.1005
irintensity: 2.4155 0.3246 1.6782 8.9328 0.2622 5.2166 0.9263 123.6322 20.6838 18.9238 0.4973 50.7691 9.0262 0.9525 17.3578 0.7073 46.5754 6.5029 4.5977 0.5041 0.6036
temp: 298.150 k
press: 1.00000 atm
elementType: 35 16 6 6 6 6 1 1 1
symmnumber: 1
zpe: 145559.2 jmol-1
zpe.correction: 0.055441 hartree
zpe.thermalcorrener: 0.061039 hartree
zpe.thermalcorrenthalpy: 0.061983 hartree
zpe.thermalcorrgfe: 0.024493 hartree
zpe.sumelectzpe: -565.281479 hartree
zpe.sumelectthermal: -565.275881 hartree
zpe.sumelectthermalent: -565.274936 hartree
zpe.sumelectthermalfe: -565.312427 hartree
dipole: 1.5280 0.9070 0.0002
dipole: 1.7769
quadrupole: -43.7445 -47.9417 -55.2188
quadrupole: 0.5992 0.0018 0.0003
quadrupole: 5.2238 1.0266 -6.2504 0.5992 0.0018 0.0003
hfenergy: -565.3369199 hartree
pointgroup: C01 [X(C4H3Br1S1)]
dipole: -0.6272977 -0.3085622 0.0000772 debye
dipolederiv: -0.5790747 0.0258164 0.0000622 0.0253891 -0.0327353 -0.0000017 0.0001234 -0.000006 0.0547942 -0.1532919 -0.0490523 0.0000465 -0.0829363 -0.2275126 0.0000182 0.0000647 0.0000489 0.1975905 -0.3290501 -0.1848385 0.0000483 -0.0175431 -0.1755778 -0.0000016 0.0000339 -0.0000158 -0.1081098 0.0470733 0.0681471 -0.0000355 -0.0856253 -0.1906716 0.0000146 -0.0000147 -0.0000371 -0.137355 0.9752468 -0.1306443 -0.0001085 -0.0597175 0.3701818 -0.0000153 -0.0002361 0.0000058 -0.3038681 -0.0533218 0.2676191 -0.0000926 0.2629574 0.1692185 -0.0000259 -0.0000538 -0.0000081 -0.3470555 0.098141 0.0377512 0.000003 0.0656012 -0.0147735 0.0000016 0.0000136 0.0000135 0.2071669 0.0024138 -0.0700812 0.0000336 -0.1018845 0.0236359 0.0000161 0.0000303 0.0000231 0.2035051 -0.0081365 0.0352826 0.0000429 -0.006241 0.0782346 -0.0000059 0.0000389 -0.0000243 0.2333319 unknown
polarizability: 105.3128612|-0.1954816|68.4545494|-0.0082382|0.0003465|25.0033024 unknown
InChI: InChI=1S/C4H3BrS/c5-4-2-1-3-6-4/h1-3H
charge 0 multiplicity 1
9 atoms
Br 2.688299 0.002704 -0.00018
S  -0.181286 1.500487 0.000029
C  -0.051039 -1.156804 0.00003
C  -1.456844 -0.81793 0.00018
C  0.763513 -0.037683 0.000043
C  -1.705567 0.544271 0.000276
H  0.334644 -2.17788 0.000033
H  -2.252117 -1.567049 0.000313
H  -2.658203 1.070883 0.000477
