program: Gaussian 09
title: 000158097
version: EM64L-G09RevD.01
frameworkgroup: C1[X(C19H23NO5)]
method: RPBEPBE
basis: SDD
operation: Freq
keyword: #p
keyword: freq=noraman
keyword: PBEPBE/SDD
title: #p freq=noraman PBEPBE/SDD
converged: YES YES NO NO
title: Mulliken charges:
elementType: O O O O O N C C C C C C C C C C C C C C C C C C C H H H H H H H H H H H H H H H H H H H H H H H
charge: -0.278261 -0.292551 -0.453492 -0.264070 -0.266035 -0.158843 0.254862 0.251263 -0.235413 -0.555439 -0.563223 -0.035280 -0.381982 -0.176538 0.318468 -0.445662 0.396586 -0.386207 -0.610434 -0.486596 -0.598630 0.122762 -0.513890 0.166697 -0.205834 0.236400 0.251164 0.240724 0.263632 0.196768 0.240961 0.195359 0.221806 0.264168 0.214592 0.211536 0.203777 0.220394 0.202550 0.228025 0.285040 0.336663 0.257524 0.200655 0.219616 0.236350 0.239175 0.230862
chargesum: 0.00000
title: Mulliken charges with hydrogens summed into heavy atoms:
elementType: O O O O O N C C C C C C C C C C C C C C C C C C C
charge: -0.278261 -0.292551 -0.116828 -0.264070 -0.266035 -0.158843 0.254862 0.251263 0.000988 -0.063551 -0.102823 0.205681 0.035183 0.087630 0.318468 -0.019534 0.396586 0.037965 -0.179859 -0.201556 -0.341106 0.122762 0.142732 0.166697 0.264203
polarizability: 2.32718522e+02 -1.26828005e+01 2.45457970e+02 5.65634398e+00 1.50303950e+01 1.76796718e+02
1716.lowfreq: -9.1213 -0.0008 -0.0005 -0.0005 8.2088 11.3709 36.6120 48.6373 56.1128
frequency: 36.5894 48.5915 56.1019 69.0838 98.1890 103.4087 108.5841 133.8347 136.7379 157.6729 170.2723 200.5729 208.6096 219.5421 234.0000 240.2812 259.7084 272.2727 289.5657 310.7261 326.3628 343.1912 358.4745 375.6351 389.1668 403.7367 430.4291 444.5421 454.1005 480.3295 490.0172 505.4070 528.6592 552.4707 591.9509 612.5283 657.8019 664.1541 673.4423 696.2235 704.6009 714.9875 744.5974 784.7049 794.8745 826.4995 830.8090 846.8702 860.8051 865.0924 875.5470 879.7457 882.6142 890.3347 916.0608 944.4343 962.8525 968.0249 973.1750 986.0705 1007.9180 1029.7290 1037.5592 1048.0235 1055.6742 1061.1480 1072.3820 1082.5105 1088.9463 1108.2508 1113.0805 1122.0550 1128.4423 1135.4754 1150.4787 1164.9925 1176.0431 1184.5645 1190.8655 1196.5230 1205.7455 1221.4957 1229.8089 1241.5421 1248.5730 1258.5854 1264.1373 1281.9338 1284.7289 1296.0087 1306.2611 1316.7185 1326.4659 1334.0126 1339.2709 1354.5824 1359.3859 1361.4110 1386.6887 1399.2440 1403.4126 1433.1691 1434.6969 1451.9022 1453.3759 1456.5824 1460.6982 1461.5142 1471.8582 1472.2804 1481.8057 1488.8994 1494.3199 1617.1251 1619.0442 2894.0347 2935.3204 2962.7653 2967.5521 2974.7085 2975.0540 2993.6535 3002.7465 3007.3333 3016.0695 3017.3340 3018.6530 3027.6200 3030.9464 3041.1805 3077.7929 3084.5885 3094.2668 3102.7888 3109.2170 3159.4482 3180.5499 3570.1114
redmass: 4.5690 4.5324 3.5082 3.9097 2.4587 3.5508 3.4453 3.8731 2.7804 2.1334 1.8611 1.8398 2.8007 2.2313 3.0012 4.1718 4.1751 4.8192 3.5278 4.1724 3.6478 4.5225 5.3801 3.7207 4.2967 3.3615 3.4880 2.6470 3.6705 3.7767 4.2854 3.3803 3.6109 3.0388 4.6092 4.0005 4.2764 6.5417 8.5349 5.3177 4.8339 5.4538 4.0034 4.0448 3.1882 1.9072 5.6617 1.7472 2.8283 2.6597 1.5799 2.1140 3.1296 2.6482 2.5962 2.6738 2.8171 3.3170 5.7802 2.5335 3.3506 2.3098 3.8710 2.5298 2.4388 2.3976 1.4992 2.3063 2.9584 2.1309 1.3010 2.1019 1.1647 1.5561 1.4209 1.8152 1.5118 2.4674 1.3895 1.4213 1.1949 1.5108 1.5377 1.3992 4.8990 2.0431 1.4097 1.5805 1.4132 1.3404 1.3472 1.5351 1.4324 1.3366 1.5215 1.3339 1.3097 1.3986 4.6060 1.9674 2.6368 3.1574 1.1375 1.1076 1.1013 1.1070 1.1855 1.0576 1.2608 1.2891 1.0978 1.6612 1.0949 7.8246 9.8458 1.0706 1.0342 1.0603 1.0638 1.0628 1.0831 1.0617 1.0827 1.0644 1.1019 1.0928 1.0983 1.0621 1.0951 1.1017 1.0899 1.0990 1.1029 1.0985 1.1093 1.0922 1.0912 1.0662
irintensity: 0.0975 0.0739 1.2777 4.4008 12.1032 1.4644 2.3818 0.5289 1.5907 0.6441 12.3176 30.2021 18.9455 32.2086 16.0015 10.4360 2.0186 21.7426 1.0820 6.1946 3.4094 4.9769 2.2742 6.5316 2.4590 1.5149 2.6584 13.5578 13.0957 3.3575 0.4326 5.7844 5.7820 4.7075 28.3165 11.1347 1.9299 6.8493 5.3733 5.2830 20.5102 2.1173 1.6535 7.7261 10.9238 5.4577 30.6399 4.8980 9.5668 25.9256 0.0507 26.7256 3.7367 34.6194 4.9709 30.0493 4.4278 40.0662 148.3952 12.6818 48.7247 27.3017 91.9165 13.9109 15.4613 26.0046 9.1165 2.3780 2.5521 11.3678 3.9731 9.4178 0.8627 14.9667 4.1317 27.5059 3.5539 33.1792 11.8204 9.4591 4.4510 15.9100 57.5057 15.5486 161.7246 10.2045 22.8702 6.8182 36.1970 5.5314 11.0483 6.3217 2.9443 3.2041 1.3227 15.2600 0.4134 1.3558 3.8314 2.9417 0.3410 2.8749 0.7588 14.1574 13.9031 12.9851 1.2555 9.4539 35.7363 102.5506 16.1402 90.5244 3.5882 0.6043 4.9558 80.0541 83.9609 36.6727 20.1866 76.8812 14.4980 134.1002 30.1587 33.1261 57.6556 9.9163 74.7356 23.4772 43.5378 58.3113 29.8757 6.0280 19.5561 25.4491 31.4145 5.9683 1.0738 6.9159
temp: 298.150 k
press: 1.00000 atm
elementType: 8 8 8 8 8 7 6 6 6 6 6 6 6 6 6 6 6 6 6 6 6 6 6 6 6 1 1 1 1 1 1 1 1 1 1 1 1 1 1 1 1 1 1 1 1 1 1 1
symmnumber: 1
zpe: 1024011.5 jmol-1
zpe.correction: 0.390025 hartree
zpe.thermalcorrener: 0.412236 hartree
zpe.thermalcorrenthalpy: 0.413180 hartree
zpe.thermalcorrgfe: 0.340000 hartree
zpe.sumelectzpe: -1166.705163 hartree
zpe.sumelectthermal: -1166.682953 hartree
zpe.sumelectthermalent: -1166.682009 hartree
zpe.sumelectthermalfe: -1166.755189 hartree
dipole: 2.2082 -0.0596 0.1375
dipole: 2.2133
quadrupole: -155.5362 -132.7710 -139.4602
quadrupole: 3.8662 2.7745 5.6377
quadrupole: -12.9471 9.8182 3.1289 3.8662 2.7745 5.6377
hfenergy: -1167.0951889 hartree
pointgroup: C01 [X(C19H23N1O5)]
dipole: -0.8698569 0.0184514 0.0351935 debye
polarizability: 233.0933629|-12.5030456|244.8063354|-4.1617187|-16.388222|177.073513 unknown
InChI: InChI=1S/C19H23NO5/c1-22-16-13(21)9-18-12-8-15-14(23-10-24-15)7-11(12)3-2-5-20(18)6-4-19(18)17(16)25-19/h7-8,13,16-17,21H,2-6,9-10H2,1H3
charge 0 multiplicity 1
48 atoms
O  3.175997 -0.487016 -1.079719
O  1.926789 2.84043 0.293063
O  2.654943 0.985166 2.689298
O  -2.654881 2.495045 -1.123976
O  -4.40422 1.335068 0.042146
N  0.930179 -2.440123 -0.567115
C  1.665267 -0.407267 -1.22558
C  0.876343 -1.043106 -0.059638
C  2.456246 0.841511 -1.028464
C  1.125916 -1.027786 -2.507438
C  1.659213 -0.790156 1.253436
C  2.544291 1.498407 0.351284
C  0.591621 -2.416061 -2.012985
C  1.832876 0.733371 1.487927
C  -0.577383 -0.461042 0.029739
C  0.525556 -3.591187 0.239527
C  -1.621952 -1.149384 0.732536
C  -0.978842 -3.673989 0.60251
C  -1.430161 -2.474499 1.473813
C  -0.859997 0.79066 -0.600792
C  -2.935781 -0.590415 0.784943
C  -2.152653 1.304023 -0.529915
C  2.869016 3.89848 -0.07822
C  -3.178246 0.626402 0.14977
C  -4.029068 2.636862 -0.576561
H  2.658891 1.506361 -1.88055
H  1.93474 -1.126827 -3.248824
H  0.31599 -0.421367 -2.948006
H  2.64979 -1.269605 1.172381
H  1.130241 -1.214097 2.127646
H  3.617617 1.581501 0.625653
H  -0.503162 -2.495455 -2.210401
H  1.089456 -3.2620 -2.52221
H  0.836254 1.201499 1.610737
H  1.113024 -3.580046 1.179983
H  0.830747 -4.5047 -0.308651
H  -1.150711 -4.613029 1.167089
H  -1.598607 -3.729523 -0.313143
H  -0.695246 -2.355237 2.296669
H  -2.38797 -2.731847 1.962405
H  -0.081944 1.358341 -1.114793
H  2.127791 0.748605 3.493328
H  -3.73767 -1.111341 1.316033
H  3.287875 3.753539 -1.096408
H  3.703432 3.958037 0.649867
H  2.29268 4.83703 -0.057357
H  -4.724252 2.854301 -1.401521
H  -4.026137 3.417667 0.208182
