program: Gaussian 09
title: 000158431
version: EM64L-G09RevD.01
frameworkgroup: C1[X(C20H31N7)]
method: RPBEPBE
basis: SDD
operation: Freq
keyword: #pfreq=noraman
keyword: PBEPBE/SDD
title: #p freq=noraman PBEPBE/SDD
converged: YES YES NO NO
title: Mulliken charges:
elementType: N N N N N N N C C C C C C C C C C C C C C C C C C C C H H H H H H H H H H H H H H H H H H H H H H H H H H H H H H H
charge: -0.298320 -0.300564 -0.408778 -0.273549 -0.067748 -0.105950 -0.630470 -0.397006 -0.341694 -0.372713 -0.361639 -0.330724 -0.467491 -0.319632 -0.358264 -0.378791 0.210836 0.051260 0.046919 -0.400964 0.201567 -0.338274 -0.275395 -0.206086 -0.289053 -0.238857 -0.206894 0.184821 0.190987 0.213344 0.197720 0.192780 0.201808 0.173755 0.195093 0.187411 0.199502 0.199420 0.207716 0.236432 0.210447 0.252258 0.248895 0.193826 0.181390 0.193472 0.214039 0.286853 0.249044 0.186090 0.215127 0.251552 0.274558 0.279854 0.227132 0.237373 0.321736 0.253838
chargesum: 0.00000
title: Mulliken charges with hydrogens summed into heavy atoms:
elementType: N N N N N N N C C C C C C C C C C C C C C C C C C C C
charge: -0.061889 -0.051669 -0.121925 -0.273549 -0.067748 -0.105950 -0.054896 -0.021197 0.069370 0.021875 0.007209 0.056190 -0.060355 0.143073 0.016952 0.028719 0.210836 0.051260 0.046919 0.034170 0.201567 -0.123148 -0.023843 0.068473 -0.009199 -0.011725 0.030479
polarizability: 3.76820167e+02 1.82119018e+01 1.99040191e+02 3.01842503e+01 6.71920810e+00 2.69615107e+02
1716.lowfreq: -8.6581 -0.0009 -0.0004 0.0003 3.1056 5.1225 14.2099 24.9399 33.4717
frequency: 13.7117 24.9028 33.3860 39.9781 48.1742 58.9380 76.8139 86.3944 89.5852 101.1800 114.3941 127.8617 129.9693 143.5619 152.3559 160.0178 167.3257 194.7062 220.3100 231.6131 240.0851 244.3544 260.8449 276.8234 279.2041 306.6485 336.8367 361.9254 380.1988 388.1895 405.8829 416.9610 423.2928 453.2046 467.3278 495.5864 504.6561 553.2018 557.5167 571.1240 576.7405 616.6117 635.2857 638.6672 646.3742 646.8115 653.3768 717.4714 729.3496 750.0630 752.6790 757.7293 770.9432 789.3725 808.0944 830.2335 834.9220 838.0949 838.3671 855.8003 869.2458 871.3944 906.2990 909.3701 933.2730 943.1322 952.3329 964.3902 974.2740 993.9341 996.7320 1012.2720 1031.6180 1039.7615 1059.6962 1060.6624 1071.5933 1075.9752 1084.7989 1096.1336 1103.0429 1112.2330 1119.6863 1124.3011 1138.9426 1148.7393 1155.5582 1164.1454 1189.9801 1206.6575 1211.5272 1225.2508 1233.8557 1239.9811 1245.8802 1252.9055 1268.4400 1274.7017 1278.7651 1280.1903 1285.8933 1288.9960 1307.7433 1323.5977 1325.4432 1331.2778 1332.9135 1339.0168 1353.6338 1356.4259 1359.6482 1367.1477 1368.1050 1382.6467 1389.5732 1410.7545 1436.6244 1441.3215 1442.2147 1459.4648 1464.7720 1466.1141 1471.4174 1474.7824 1477.2369 1480.3428 1482.9495 1483.3478 1488.1978 1493.7190 1495.1409 1517.1434 1517.9238 1568.5892 1602.4618 1628.2393 1637.2167 2826.8737 2844.1424 2844.5609 2856.8227 2929.8281 2947.8580 2956.6241 2971.3227 2971.5620 2982.3716 2983.2725 2987.5575 2993.7427 2995.3598 3011.0971 3024.1048 3029.3061 3051.5937 3052.7254 3078.8273 3130.9927 3151.3988 3168.8815 3170.7339 3187.3315 3194.5830 3425.7206 3426.8861 3433.4070 3569.9621 3597.4223
redmass: 5.0896 5.1262 4.2872 4.5871 4.0300 2.5311 3.8430 4.3061 4.3514 1.7363 4.1706 2.4639 3.3453 3.1907 2.5285 2.8832 2.6427 3.5151 2.6547 2.5050 3.6400 2.8614 2.3976 4.3190 2.3447 1.4101 2.3150 3.5604 7.3244 1.3472 3.2481 3.1813 3.1245 3.5954 4.7918 3.1765 2.7143 2.6671 3.9752 3.9157 5.5527 7.0285 1.4646 1.4247 1.3205 3.1604 3.2511 5.8067 4.5264 1.3846 1.1315 1.1650 7.6978 1.4171 1.6379 5.0966 1.4405 5.7085 1.5585 1.9227 2.7117 1.9516 1.7515 2.7503 1.3396 1.8129 1.3300 1.2963 1.9905 2.4298 1.9448 1.5783 2.8780 3.5897 2.4233 2.2580 2.1813 2.0078 2.3378 1.9594 2.1567 2.2786 1.4794 1.6717 1.3448 3.6176 3.0301 1.9057 1.5342 1.2817 1.4638 1.7479 1.5306 2.4591 1.5144 1.4940 1.3478 1.4574 1.2583 1.1237 1.4510 1.2177 1.3211 1.8454 1.2402 1.3373 1.4643 1.6433 1.7648 1.4504 1.4602 1.4891 2.3606 1.4500 1.3928 3.6149 1.2019 1.1918 3.3023 1.1298 1.1261 1.1165 1.1091 1.1071 1.6150 1.1043 1.1159 1.6629 1.2339 1.6947 1.0994 5.4305 5.1706 5.5571 7.6728 1.2517 3.8371 1.0713 1.0716 1.0719 1.0711 1.0691 1.0692 1.0608 1.0809 1.0644 1.0658 1.0833 1.0636 1.0882 1.0894 1.0955 1.0985 1.0942 1.1033 1.0999 1.0901 1.0891 1.0881 1.0965 1.0892 1.0959 1.1009 1.0740 1.0741 1.0499 1.0769 1.0961
irintensity: 0.3042 0.0193 1.0835 0.1799 2.8102 2.2924 1.4296 0.8536 0.9459 0.9795 5.5631 0.4695 1.7982 1.8017 0.3605 2.4539 2.1136 2.1327 6.3879 0.3604 1.0337 3.1084 6.3555 9.9233 15.2127 69.9343 8.2227 0.9597 1.3940 102.5520 22.6708 6.3469 5.9121 8.2387 0.8832 2.9791 2.0892 8.6078 3.7887 1.1013 3.3661 1.8349 59.3725 129.4269 169.5904 14.0039 8.4873 1.3947 3.3081 102.1043 8.8848 21.3664 0.9326 1.8380 59.3257 2.0531 1.7046 8.3332 1.5097 4.0818 0.8623 3.0101 8.3513 1.3722 1.4659 0.5987 0.5728 0.5695 2.6366 3.8345 17.3235 1.5358 9.1676 1.1334 2.9007 6.8012 1.8723 2.5161 1.7986 3.2419 19.4723 3.4245 8.1162 16.1656 25.6146 47.4215 32.7095 19.6602 7.9821 0.5603 32.0206 11.9471 9.6515 19.7297 74.9991 42.6564 5.7341 2.0122 4.5193 1.6968 0.6032 0.8131 0.2229 29.9232 7.5715 5.4487 6.4641 13.2411 1.7262 6.1216 9.0108 7.8722 40.7005 4.7073 2.0556 88.5386 40.8749 12.3804 26.6535 28.0370 6.9622 6.5933 0.9222 16.6723 12.8327 4.1009 1.6949 110.3691 23.1384 6.7066 3.7629 53.2929 60.4162 195.2529 221.8258 41.5081 52.5555 72.8295 203.8439 56.1458 238.6484 68.6066 43.2746 49.4800 42.7737 102.2926 41.4095 32.0212 34.6484 11.5364 34.7533 30.8713 55.9945 18.1423 66.5171 80.2154 8.5270 13.5169 7.8478 13.0599 5.2425 0.8922 10.7449 1.1300 2.1464 72.8042 59.0053 22.8893
temp: 298.150 k
press: 1.00000 atm
elementType: 7 7 7 7 7 7 7 6 6 6 6 6 6 6 6 6 6 6 6 6 6 6 6 6 6 6 6 1 1 1 1 1 1 1 1 1 1 1 1 1 1 1 1 1 1 1 1 1 1 1 1 1 1 1 1 1 1 1
symmnumber: 1
zpe: 1300918.6 jmol-1
zpe.correction: 0.495494 hartree
zpe.thermalcorrener: 0.522761 hartree
zpe.thermalcorrenthalpy: 0.523706 hartree
zpe.thermalcorrgfe: 0.436288 hartree
zpe.sumelectzpe: -1161.914865 hartree
zpe.sumelectthermal: -1161.887597 hartree
zpe.sumelectthermalent: -1161.886653 hartree
zpe.sumelectthermalfe: -1161.974071 hartree
dipole: -4.9284 0.5442 1.2357
dipole: 5.1100
quadrupole: -144.1869 -166.0591 -147.4745
quadrupole: 4.8747 6.3143 1.4127
quadrupole: 8.3866 -13.4856 5.0990 4.8747 6.3143 1.4127
hfenergy: -1162.4103585 hartree
pointgroup: C01 [X(C20H31N7)]
dipole: 1.9416945 -0.0873848 0.5138372 debye
polarizability: 374.5689189|29.466968|202.0477676|-28.320324|-7.9893067|268.8587787 unknown
InChI: InChI=1S/C20H31N7/c21-10-5-13-22-11-2-3-12-23-14-6-15-24-18-9-8-17-20(26-18)27-16-4-1-7-19(27)25-17/h1,4,7-9,16,22-24H,2-3,5-6,10-15,21H2
charge 0 multiplicity 1
58 atoms
N  4.205912 -1.141266 0.611627
N  -1.006689 -2.70257 0.1048
N  3.093516 2.023787 -0.605414
N  -1.421749 1.368262 0.901404
N  0.92517 1.728308 0.268549
N  -2.401086 1.373217 -1.206329
N  -4.371461 -0.937669 -1.912286
C  2.813132 -3.228611 0.462291
C  1.475013 -2.525802 0.141357
C  4.045207 -2.454019 -0.053196
C  0.246904 -3.419109 0.4091
C  5.122968 -0.203301 -0.062791
C  5.117712 1.191905 0.601323
C  3.716565 1.831347 0.710102
C  -2.234777 -3.527317 0.053677
C  -3.465788 -2.665752 -0.304239
C  1.72973 1.90398 -0.82406
C  -0.385804 1.576714 -0.020199
C  -1.01785 1.584403 -1.305012
C  -3.345251 -1.977552 -1.688262
C  -2.636751 1.242144 0.127565
C  1.205379 1.954959 -2.173481
C  -0.163683 1.793795 -2.422147
C  -1.392396 1.287703 2.286703
C  -3.84528 0.994169 0.843771
C  -2.57988 1.066958 2.96535
C  -3.814988 0.913298 2.236429
H  2.824062 -4.234983 -0.006601
H  2.905596 -3.395731 1.556538
H  1.405116 -1.585197 0.721703
H  1.455949 -2.228295 -0.925555
H  4.956524 -3.097494 0.041632
H  3.909911 -2.259766 -1.136034
H  0.287666 -3.813408 1.459002
H  0.292982 -4.306773 -0.255082
H  6.181212 -0.56911 -0.108471
H  4.779627 -0.108874 -1.11225
H  5.806017 1.855044 0.036473
H  5.534022 1.121097 1.62697
H  4.424281 -1.245417 1.613019
H  3.788565 2.795487 1.257632
H  3.047783 1.172455 1.287315
H  -1.1304 -1.872559 0.702412
H  -2.084218 -4.306223 -0.723302
H  -2.43263 -4.071609 1.013054
H  -4.377418 -3.294889 -0.267166
H  -3.602664 -1.871811 0.456694
H  3.689823 2.234887 -1.405015
H  -2.34249 -1.516178 -1.741467
H  -3.369906 -2.759526 -2.479849
H  1.901553 2.105509 -3.00642
H  -0.563239 1.819292 -3.44009
H  -0.41305 1.411215 2.754248
H  -4.755838 0.830981 0.262892
H  -2.566354 1.006019 4.056621
H  -4.740444 0.718793 2.787433
H  -3.97824 -0.005179 -2.085019
H  -5.144369 -1.195641 -2.527549
