program: Gaussian 09
title: 000158087
version: EM64L-G09RevD.01
frameworkgroup: C1[X(C14H20O4S2)]
method: RPBEPBE
basis: SDD
operation: Freq
keyword: #p
keyword: freq=noraman
keyword: PBEPBE/SDD
title: #p freq=noraman PBEPBE/SDD
converged: YES YES NO NO
title: Mulliken charges:
elementType: S S O O O O C C C C C C C C C C C C C C H H H H H H H H H H H H H H H H H H H H
charge: 0.357907 0.396626 -0.272094 -0.314577 -0.285738 -0.225782 0.060556 0.071359 -0.379138 -0.377262 -0.709537 -0.708876 -0.692845 -0.689166 0.270552 0.225733 0.220969 -0.677822 -0.375978 -0.386658 0.225045 0.230919 0.218597 0.190641 0.208287 0.193136 0.232131 0.249171 0.208964 0.218325 0.251764 0.213401 0.239313 0.206090 0.213940 0.240002 0.208509 0.213934 0.264881 0.264722
chargesum: 0.00000
title: Mulliken charges with hydrogens summed into heavy atoms:
elementType: S S O O O O C C C C C C C C C C C C C C
charge: 0.357907 0.396626 -0.272094 -0.314577 -0.285738 -0.225782 0.285601 0.302278 0.030101 0.024161 -0.019271 -0.025386 -0.033503 -0.026721 0.270552 0.225733 0.220969 -0.677822 -0.111097 -0.121936
polarizability: 2.56866077e+02 -2.32356853e+01 2.39631942e+02 -1.15835722e+01 1.47674963e+01 1.36849750e+02
1716.lowfreq: -16.8616 -10.0752 0.0017 0.0020 0.0021 6.2964 8.1682 11.4095 37.6472
frequency: -10.7547 -4.2177 37.5848 41.3513 57.2599 64.7307 80.3112 85.3211 86.8207 108.4903 114.6265 141.1505 167.4488 188.6926 210.5869 213.2269 215.8801 218.7477 225.5314 244.7334 256.0410 277.7374 297.6817 342.1270 372.5867 384.9407 390.6778 417.7471 431.9967 433.5187 456.4583 475.6697 480.6567 520.0965 586.3120 641.2980 662.7154 670.5098 686.2455 716.2531 738.6965 757.3871 760.1175 765.0712 815.1827 816.7191 838.7369 846.0950 851.3977 866.7641 896.5985 965.6307 967.5762 991.7524 993.8374 1015.5386 1035.7599 1035.9858 1094.6416 1107.5520 1109.7464 1127.1091 1128.4686 1165.9144 1178.7497 1183.3985 1236.2156 1256.5429 1261.0747 1270.7815 1293.5997 1297.1022 1327.4453 1337.3027 1354.1526 1357.6608 1383.4685 1387.4763 1388.5627 1390.3143 1451.8214 1452.4600 1464.4010 1465.7654 1474.5601 1475.7327 1478.7095 1479.8799 1480.7903 1487.1104 1488.4908 1550.3642 1563.2292 1617.3608 2981.2987 2982.2114 2984.8659 2987.4951 2989.9283 2992.1853 3013.1576 3016.6769 3040.7622 3044.9892 3075.2604 3076.8239 3085.3979 3087.3256 3092.4682 3093.6626 3101.0941 3103.9493 3191.7336 3219.7184
redmass: 3.2984 3.5520 3.8606 5.1013 5.1736 4.0164 4.7926 3.8256 6.4862 2.2984 2.0946 6.0942 3.0404 2.5333 2.0904 1.3648 1.2979 1.1436 2.0208 2.7579 4.8159 4.4585 5.7047 5.0821 4.1879 3.4018 4.4335 4.1786 3.6743 3.3413 11.3679 3.0184 3.1055 9.7548 9.1912 8.7677 8.7129 1.2265 7.3740 4.5480 2.7778 4.0539 2.2375 3.6936 1.8520 1.9343 3.6990 2.8476 1.2348 2.7305 5.0832 1.2677 1.2767 1.3975 1.4194 11.6686 3.1709 3.1957 1.0421 1.7879 1.8032 2.2683 2.2335 5.0144 2.0215 2.1402 1.4644 1.5444 1.2677 1.7198 1.3057 1.3848 1.2568 1.5171 1.6927 1.7115 1.2212 1.2222 1.2139 1.2130 1.0768 1.0753 1.0986 1.0638 1.0448 1.0464 1.7193 1.0486 1.8369 1.0873 1.0641 10.5246 7.9876 11.9600 1.0368 1.0468 1.0456 1.0515 1.0400 1.0444 1.0863 1.0870 1.0990 1.0994 1.0995 1.0996 1.0986 1.0985 1.0999 1.1000 1.1005 1.1009 1.0856 1.1053
irintensity: 0.2064 0.1150 2.8685 0.5829 0.5434 0.1785 1.3654 2.6227 0.2891 0.1086 0.3025 0.1293 0.4230 3.4179 0.2302 0.5042 1.1896 0.1008 1.6890 4.0271 10.7624 2.6954 2.2173 1.6348 4.5172 9.1095 12.1247 0.1466 6.3112 0.3718 16.7829 0.9201 1.5816 11.7996 1.6612 5.1492 3.8146 108.8649 3.7806 8.7110 2.5817 6.3504 9.8414 16.1653 23.7258 18.5395 0.9392 1.5574 0.0963 30.4254 94.3302 8.4769 6.6858 42.2586 64.1620 412.5505 21.6975 7.2336 2.0001 47.5184 25.4018 26.0282 22.4618 358.7995 30.5457 28.2576 111.0926 98.3458 10.1747 205.0631 1.4939 19.4129 1.4596 31.0659 2.6563 4.5899 22.0674 18.3491 13.6045 29.3925 5.8303 3.4228 12.3838 36.7749 10.0285 5.2765 88.5421 17.8553 197.4281 6.2000 21.5256 109.4317 34.4093 395.8394 31.5240 31.2213 18.3302 6.5966 32.7106 48.0789 7.6885 4.2070 18.0725 12.5683 42.4233 39.3771 34.6063 18.4137 74.4554 55.5965 17.3434 19.4911 2.1903 0.6637
temp: 298.150 k
press: 1.00000 atm
elementType: 16 16 8 8 8 8 6 6 6 6 6 6 6 6 6 6 6 6 6 6 1 1 1 1 1 1 1 1 1 1 1 1 1 1 1 1 1 1 1 1
symmnumber: 1
zpe: 823578.5 jmol-1
zpe.correction: 0.313684 hartree
zpe.thermalcorrener: 0.335362 hartree
zpe.thermalcorrenthalpy: 0.336306 hartree
zpe.thermalcorrgfe: 0.262771 hartree
zpe.sumelectzpe: -1640.945773 hartree
zpe.sumelectthermal: -1640.924096 hartree
zpe.sumelectthermalent: -1640.923151 hartree
zpe.sumelectthermalfe: -1640.996686 hartree
dipole: -2.9441 0.1460 1.1736
dipole: 3.1728
quadrupole: -111.8594 -123.0060 -138.3285
quadrupole: -6.6264 0.7982 0.6854
quadrupole: 12.5385 1.3920 -13.9305 -6.6264 0.7982 0.6854
hfenergy: -1641.2594571 hartree
pointgroup: C01 [X(C14H20O4S2)]
dipole: -0.9914154 0.2295573 0.7228828 debye
polarizability: 240.4179551|-24.1251849|246.68641|-35.7767794|8.651515|146.2434044 unknown
InChI: InChI=1S/C14H20O4S2/c1-5-9(3)17-12(15)11(14-19-7-8-20-14)13(16)18-10(4)6-2/h7-10H,5-6H2,1-4H3
charge 0 multiplicity 1
40 atoms
S  -2.482371 1.453594 0.797783
S  -0.156402 3.318929 0.125024
O  2.21183 -0.403983 -0.498832
O  -1.52133 -1.122705 0.669181
O  1.940659 1.905157 -0.671509
O  -0.149657 -1.731266 -1.116877
C  3.664243 -0.267622 -0.885001
C  -2.235709 -2.448989 0.580876
C  4.361184 -1.482632 -0.255395
C  -2.749216 -2.736177 1.99984
C  3.75793 -0.214835 -2.415916
C  -3.339724 -2.348362 -0.48101
C  4.320994 -1.481506 1.286687
C  -1.619123 -2.922317 3.033067
C  0.030828 0.505188 -0.137457
C  1.450365 0.750292 -0.484553
C  -0.507148 -0.879597 -0.270048
C  -0.762663 1.594742 0.219626
C  -2.763999 3.237029 0.943311
C  -1.724526 4.060172 0.667302
H  4.03219 0.678635 -0.443075
H  -1.479108 -3.195978 0.273093
H  3.88602 -2.401653 -0.648565
H  5.411519 -1.484147 -0.608686
H  -3.41754 -1.909538 2.309863
H  -3.372739 -3.651032 1.9488
H  3.314972 -1.123013 -2.860601
H  3.230368 0.669461 -2.810701
H  4.817271 -0.15021 -2.725968
H  -4.070659 -1.564866 -0.213193
H  -2.911327 -2.114965 -1.47014
H  -3.87482 -3.312729 -0.559272
H  3.277381 -1.489357 1.64593
H  4.818259 -0.583351 1.699414
H  4.832666 -2.37075 1.697166
H  -0.993428 -2.014944 3.090058
H  -0.964687 -3.771157 2.759365
H  -2.030139 -3.121912 4.039102
H  -3.758853 3.541487 1.271327
H  -1.74281 5.149508 0.73028
