program: Gaussian 09
title: 000155003
version: EM64L-G09RevD.01
frameworkgroup: C1[X(C11H15NO2)]
method: RPBEPBE
basis: SDD
operation: Freq
keyword: #p
keyword: freq=noraman
keyword: PBEPBE/SDD
title: #p freq=noraman PBEPBE/SDD
converged: YES YES NO NO
title: Mulliken charges:
elementType: O O N C C C C C C C C C C C H H H H H H H H H H H H H H H
charge: -0.432417 -0.274947 -0.082570 -0.063680 -0.575233 0.520723 -0.686459 -0.636654 -0.398696 -0.366000 -0.076768 -0.385722 -0.356421 0.280242 0.230450 0.206077 0.217184 0.236626 0.214401 0.216586 0.222635 0.248809 0.275385 0.229793 0.245042 0.165523 0.217844 0.255423 0.352826
chargesum: 0.00000
title: Mulliken charges with hydrogens summed into heavy atoms:
elementType: O O N C C C C C C C C C C C
charge: -0.079591 -0.274947 -0.082570 0.166770 -0.151973 0.520723 -0.018847 0.110175 -0.168903 -0.120958 0.088755 -0.167878 -0.100998 0.280242
polarizability: 1.58818059e+02 -6.37346002e+00 1.33499101e+02 1.89797735e+01 1.18873386e+01 9.49679322e+01
1716.lowfreq: -17.4377 -6.3807 -0.0008 0.0004 0.0007 3.9486 27.2323 44.1676 56.3695
frequency: 27.1940 44.1204 56.3219 78.1878 117.3029 164.0085 177.8135 207.1099 218.5221 258.0452 294.0210 320.4244 333.5195 353.5264 362.3903 401.7656 411.5944 442.4398 471.2587 506.4403 552.9131 609.4642 636.4075 714.2385 758.5993 799.2004 811.5566 824.3650 842.0525 888.3435 894.2714 930.9458 964.3739 968.8699 1000.0245 1003.4437 1045.5647 1090.0178 1102.8481 1115.5149 1125.5098 1143.1674 1180.3854 1180.5802 1200.8209 1216.9340 1248.3685 1280.6762 1296.5402 1320.7610 1322.3838 1382.6195 1389.8600 1391.5262 1404.7503 1425.1458 1432.9991 1463.9759 1468.5396 1479.2133 1480.9032 1487.6383 1504.4792 1596.2229 1624.6606 1627.0605 2941.6170 2975.0072 2984.5086 2988.2264 3013.1231 3046.5752 3057.8377 3082.7174 3092.2522 3107.2214 3107.7072 3130.9646 3136.4090 3172.2597 3582.0304
redmass: 4.9362 4.6410 3.8735 3.2018 4.4399 1.0927 3.5857 1.1235 3.9969 2.9262 3.0708 3.3474 2.7561 1.1116 3.5627 3.1285 2.9569 4.0976 3.0429 3.2250 3.0561 3.2993 6.7537 3.6931 3.8635 2.1869 1.8409 3.2501 1.7680 1.8895 1.7494 1.3608 1.4040 1.5263 2.0901 2.7882 1.6106 2.6856 1.4706 1.6169 1.3998 1.3728 1.2259 1.1853 3.3019 2.2848 2.8286 1.3442 1.8450 1.4885 1.2689 1.2547 1.7234 2.7801 1.3716 2.8185 1.3429 1.0852 1.0532 1.0636 1.1279 1.0596 2.7720 6.3504 5.6884 6.2476 1.0835 1.0354 1.0467 1.0489 1.0861 1.1014 1.1017 1.0991 1.1003 1.0871 1.0987 1.0960 1.0905 1.0956 1.0660
irintensity: 1.2132 0.7946 0.1581 1.1852 0.4666 0.2338 1.0478 0.3363 3.2849 0.7665 3.6093 11.3487 8.1377 149.2738 10.7848 8.5722 0.7350 14.8481 5.1622 11.4526 26.5896 6.1439 1.0001 1.8837 18.5593 24.0672 11.3786 7.7719 34.7434 0.8235 0.7544 0.0060 0.9037 1.4362 12.6126 3.4297 26.4220 22.0714 86.0183 13.9334 2.8521 216.2315 17.4934 0.6645 32.6120 1.3966 31.7009 0.7229 36.8299 6.4959 13.2344 20.4102 39.2448 2.4230 14.2536 14.7183 42.7934 1.5892 16.9189 3.6349 8.7267 12.3476 94.1769 8.7032 263.6669 98.1680 78.9402 33.0398 3.5738 59.0489 11.3602 17.0091 30.4966 39.9904 28.8391 17.5085 1.9858 24.6565 5.6432 3.9388 38.9140
temp: 298.150 k
press: 1.00000 atm
elementType: 8 8 7 6 6 6 6 6 6 6 6 6 6 6 1 1 1 1 1 1 1 1 1 1 1 1 1 1 1
symmnumber: 1
zpe: 627400.7 jmol-1
zpe.correction: 0.238964 hartree
zpe.thermalcorrener: 0.253502 hartree
zpe.thermalcorrenthalpy: 0.254446 hartree
zpe.thermalcorrgfe: 0.196604 hartree
zpe.sumelectzpe: -632.307610 hartree
zpe.sumelectthermal: -632.293072 hartree
zpe.sumelectthermalent: -632.292128 hartree
zpe.sumelectthermalfe: -632.349970 hartree
dipole: 1.7927 5.6154 1.9573
dipole: 6.2110
quadrupole: -83.4920 -91.3159 -80.9486
quadrupole: -7.0896 4.5256 0.3371
quadrupole: 1.7601 -6.0637 4.3036 -7.0896 4.5256 0.3371
hfenergy: -632.5465741 hartree
pointgroup: C01 [X(C11H15N1O2)]
dipole: -0.8486888 2.2030232 -0.6305898 debye
polarizability: 157.4797014|6.7550375|135.7225618|20.7925166|-7.7604725|94.0828297 unknown
InChI: InChI=1S/C11H15NO2/c1-9(12(2)8-13)7-10-3-5-11(14)6-4-10/h3-6,8-9,14H,7H2,1-2H3
charge 0 multiplicity 1
29 atoms
O  -4.275551 -1.175581 -0.470328
O  3.097591 -2.221596 0.242104
N  2.131807 -0.218376 -0.530909
C  1.801871 1.209049 -0.244086
C  0.733563 1.350345 0.890561
C  -0.601906 0.706369 0.554632
C  3.064484 2.050334 0.060601
C  1.677112 -0.812764 -1.801155
C  -1.607188 1.439375 -0.125028
C  -0.870483 -0.651119 0.876866
C  2.806287 -0.997193 0.388649
C  -2.837997 0.844972 -0.481828
C  -2.091184 -1.262148 0.527854
C  -3.076238 -0.511396 -0.153871
H  1.349249 1.597039 -1.176034
H  0.597206 2.433412 1.077108
H  1.152434 0.917279 1.819054
H  3.82851 1.904104 -0.722756
H  3.513565 1.779797 1.032992
H  2.805914 3.124137 0.099326
H  2.113552 -0.273807 -2.663243
H  0.5748 -0.781535 -1.87535
H  2.012093 -1.862287 -1.823119
H  -1.433201 2.493612 -0.374741
H  -0.113941 -1.241459 1.406663
H  3.085678 -0.434877 1.307294
H  -3.604628 1.434431 -1.002051
H  -2.298186 -2.307074 0.776388
H  -4.902314 -0.568744 -0.936796
