program: Gaussian 09
title: 000154999
version: EM64L-G09RevD.01
frameworkgroup: C1[X(C12H10FNO)]
method: RPBEPBE
basis: SDD
operation: Freq
keyword: #p
keyword: freq=noraman
keyword: PBEPBE/SDD
title: #p freq=noraman PBEPBE/SDD
converged: NO YES NO NO
title: Mulliken charges:
elementType: F O N C C C C C C C C C C C C H H H H H H H H H H
charge: -0.208763 -0.413243 -0.370304 0.354742 0.353158 -0.379638 -0.381935 0.419222 -0.364043 -0.363659 -0.380904 -0.426907 -0.380190 -0.380126 0.318264 0.235265 0.235761 0.242439 0.241051 0.254495 0.225549 0.252691 0.252541 0.295288 0.369247
chargesum: 0.00000
title: Mulliken charges with hydrogens summed into heavy atoms:
elementType: F O N C C C C C C C C C C C C
charge: -0.208763 -0.043996 -0.075016 0.354742 0.353158 -0.144373 -0.146174 0.419222 -0.121603 -0.122609 -0.126409 -0.201358 -0.127499 -0.127585 0.318264
polarizability: 2.59184093e+02 -3.07002667e-01 1.33343816e+02 -3.79835589e+00 2.52136465e+00 6.46923474e+01
1716.lowfreq: -3.5833 -0.0008 -0.0006 0.0005 3.0443 8.0786 46.1097 63.6176 79.1525
frequency: 46.1023 63.6151 79.1333 103.6922 142.8558 214.4554 239.8292 262.6699 337.6638 354.2250 389.8917 409.4336 415.2861 433.5956 457.5463 502.0656 536.3049 550.8433 609.4979 625.3130 638.0285 690.6720 712.8738 732.5449 796.0326 813.3079 814.5062 828.3898 839.9784 849.9736 938.1589 944.3867 953.7917 960.8240 968.3237 988.9120 1004.9567 1021.6530 1107.9155 1124.7388 1157.2830 1188.6518 1206.3462 1250.2935 1292.1798 1295.8422 1302.7756 1315.3229 1333.0002 1369.8127 1407.1827 1421.5219 1445.8359 1483.6239 1520.1540 1578.1747 1595.6938 1611.5120 1626.2848 3118.4061 3134.0832 3142.5940 3145.2936 3147.1341 3172.6490 3175.8381 3177.9995 3446.2664 3520.8447
redmass: 7.2903 4.2177 5.5232 4.2058 6.8689 7.0098 4.6074 7.0546 1.6050 5.6100 3.0478 2.9291 2.9849 5.2174 3.8860 3.0468 3.0129 3.2224 3.2080 6.4000 6.6140 3.3520 3.8357 3.6365 5.0898 1.4267 1.3557 1.4000 2.1668 2.2573 1.3412 1.3766 1.3558 1.5910 2.6972 5.5703 2.7983 2.3218 1.3370 1.3471 1.5078 1.1948 1.8272 1.7967 2.7130 1.3764 1.3882 1.5087 2.8862 5.5930 2.8420 3.4722 1.6411 2.4339 3.1038 5.5230 7.5778 6.3571 6.3382 1.0872 1.0895 1.0912 1.0897 1.0921 1.0958 1.0966 1.0941 1.0769 1.0685
irintensity: 0.0435 0.5687 0.1065 0.6794 3.1230 0.3948 3.5346 0.3004 49.1365 15.4990 20.0791 7.7737 0.3241 3.3371 4.9268 87.0925 56.5178 34.2635 149.1631 11.2136 7.9582 155.8821 3.4612 4.9621 7.4373 45.5094 37.0454 68.3773 40.9453 36.2524 0.5431 0.1105 0.8870 10.2280 34.4960 8.4000 3.8088 1.0582 10.6389 4.3342 54.3956 1.1348 60.6732 11.5428 0.9754 3.5333 4.8868 121.4888 5.8554 1.4141 2.5038 1.5691 16.6273 254.1717 0.5099 0.7722 2.3980 0.4383 96.5488 16.8667 13.3218 5.6104 14.1767 10.8950 7.2327 4.2598 4.1362 7.1813 33.7537
temp: 298.150 k
press: 1.00000 atm
elementType: 9 8 7 6 6 6 6 6 6 6 6 6 6 6 6 1 1 1 1 1 1 1 1 1 1
symmnumber: 1
zpe: 496968.2 jmol-1
zpe.correction: 0.189285 hartree
zpe.thermalcorrener: 0.201973 hartree
zpe.thermalcorrenthalpy: 0.202917 hartree
zpe.thermalcorrgfe: 0.149608 hartree
zpe.sumelectzpe: -691.991603 hartree
zpe.sumelectthermal: -691.978915 hartree
zpe.sumelectthermalent: -691.977971 hartree
zpe.sumelectthermalfe: -692.031280 hartree
dipole: 3.7429 0.4850 -0.7937
dipole: 3.8567
quadrupole: -86.1972 -72.1567 -92.5219
quadrupole: 0.1911 -4.8529 2.8613
quadrupole: -2.5719 11.4686 -8.8966 0.1911 -4.8529 2.8613
hfenergy: -692.1808881 hartree
pointgroup: C01 [X(C12H10F1N1O1)]
dipole: 1.4682062 -0.1945579 0.3299767 debye
dipolederiv: -1.4068788 0.0545963 -0.0416516 0.0604813 -0.2059878 -0.0178601 -0.0415994 -0.0156058 -0.1584798 -0.7487744 0.0002683 0.0889802 -0.1749982 -0.3509011 0.0570571 0.5308887 0.1326664 -0.0321105 -1.0461129 0.1228694 -0.2185738 0.3079518 0.1595723 -0.0094607 -1.1122415 -0.0271473 -0.3192619 -0.0625415 -0.0155753 -0.0067616 -0.0093516 -0.1563828 0.0119229 0.0028691 0.0455087 -0.0346756 0.6465648 -0.0258227 0.0212275 -0.0352442 -0.1027711 -0.0096958 0.0165885 -0.0380304 -0.0054218 0.1753494 0.0664475 0.0089964 0.044772 0.0921242 -0.0791084 0.0889076 -0.07127 -0.1015598 0.1656074 -0.0689587 0.0210199 -0.0647987 0.0829592 -0.0731637 -0.0742164 -0.0693815 -0.1086548 1.4601842 -0.0124102 0.1172457 -0.176562 -0.0489937 0.0460815 0.2707948 0.0306179 0.0553432 -0.1216874 -0.0282526 0.0065052 0.1312563 0.0455351 0.0902877 0.0660596 0.0681217 -0.1148525 -0.1274093 0.035322 0.0022745 -0.1200581 0.0532879 0.0811239 -0.0581034 0.0773826 -0.1184959 -0.4070698 -0.0196012 -0.0181961 0.3951791 -0.0108563 -0.0347298 -0.151717 -0.0723591 -0.1775097 -0.4908443 0.0232715 -0.0081571 -0.3211298 0.055436 -0.0904231 0.1446925 -0.0801576 -0.1689794 -0.196611 0.0102605 0.0000094 -0.1942392 -0.0147438 0.0377152 -0.1001347 0.0549503 -0.1411137 -0.182592 0.0014235 0.0021111 0.2074276 -0.0336443 0.0502273 0.1008724 0.0467102 -0.1351423 1.3662542 -0.0551962 0.043639 -0.0574313 0.2170272 0.0417936 0.0443787 0.04558 0.0903909 0.0580833 0.0898059 -0.028076 0.0893913 -0.0329083 0.057356 -0.0355897 0.0493588 0.1202412 0.0378279 -0.1052126 0.0308457 -0.0975362 -0.0168615 0.0475103 0.0325068 0.0398974 0.127039 0.0516265 -0.0903102 -0.0400107 -0.0837251 0.0000302 -0.0617932 -0.0410181 -0.0530531 0.1177315 0.0634569 0.0890735 0.029684 0.0819028 -0.0175666 -0.0601715 0.0332604 -0.0517491 0.1221002 0.0387387 -0.0690798 0.0121708 -0.0740914 0.00366 0.0422648 -0.0013224 0.0506841 0.1538055 -0.0013345 0.0958242 -0.029009 0.100992 -0.0440008 0.0542052 -0.0167044 0.058414 0.1475579 0.0356833 0.0617879 0.014839 0.0835689 0.0054538 -0.0555057 0.0208763 -0.0575991 0.160855 0.0249217 -0.0605611 -0.0289424 -0.0816112 0.0189896 -0.0587808 -0.0356918 -0.0588975 0.1575878 0.2260483 -0.0660593 0.0688341 -0.0250559 0.0459517 -0.0148228 0.3409041 -0.0491738 0.2685739 0.4415094 -0.0339105 -0.0490041 0.0129097 0.2555909 -0.0520299 -0.0252608 -0.055468 0.0950317 unknown
polarizability: 259.0688286|-0.0988709|133.3552736|6.0851812|2.3364638|64.7961538 unknown
InChI: InChI=1S/C12H10FNO/c13-11-5-1-9(2-6-11)10-3-7-12(14-15)8-4-10/h1-8,14-15H
charge 0 multiplicity 1
25 atoms
F  -5.359348 0.184037 -0.117536
O  5.373371 0.723433 -0.403866
N  4.625971 -0.324965 0.309236
C  0.352436 -0.09926 0.07046
C  -1.134211 -0.026838 0.021928
C  1.158763 1.04013 -0.200712
C  1.023748 -1.314789 0.383805
C  3.212522 -0.23567 0.163333
C  -1.822614 1.166727 0.381266
C  -1.912743 -1.147502 -0.385081
C  2.56492 0.983895 -0.156861
C  2.426766 -1.391065 0.428732
C  -3.229995 1.248998 0.336086
C  -3.321303 -1.089172 -0.432923
C  -3.950825 0.113658 -0.07083
H  0.680848 1.983083 -0.490058
H  0.439818 -2.210023 0.625676
H  -1.253752 2.034663 0.730873
H  -1.411611 -2.069013 -0.699759
H  3.167069 1.861781 -0.403984
H  2.913174 -2.338829 0.690377
H  -3.760492 2.162584 0.619929
H  -3.920188 -1.946395 -0.754144
H  5.033665 -1.228751 0.032477
H  5.796209 1.24278 0.330877
