program: Gaussian 09
title: 000154984
version: EM64L-G09RevD.01
frameworkgroup: C1[X(C21H24ClN3O2)]
method: RPBEPBE
basis: SDD
operation: Freq
keyword: #p
keyword: freq=noraman
keyword: PBEPBE/SDD
title: #p freq=noraman PBEPBE/SDD
converged: YES YES NO NO
title: Mulliken charges:
elementType: Cl O O N N N C C C C C C C C C C C C C C C C C C C C C H H H H H H H H H H H H H H H H H H H H H H H H
charge: -0.065051 -0.268667 -0.278496 -0.417434 -0.052346 -0.382971 -0.462413 -0.349871 -0.386601 -0.356068 0.303766 0.295204 0.219260 -0.535354 -0.117421 -0.079441 -0.496116 -0.290232 -0.321563 -0.302862 0.282096 0.257308 -0.357958 -0.297453 -0.106970 -0.607033 -0.536063 0.215536 0.207648 0.207063 0.195673 0.242970 0.218519 0.238861 0.198780 0.302601 0.236758 0.204935 0.213833 0.252017 0.264963 0.287862 0.247290 0.253489 0.301995 0.225290 0.225438 0.277413 0.222690 0.247515 0.221611
chargesum: 0.00000
title: Mulliken charges with hydrogens summed into heavy atoms:
elementType: Cl O O N N N C C C C C C C C C C C C C C C C C C C C C
charge: -0.065051 -0.268667 -0.278496 -0.114833 -0.052346 -0.080976 -0.039230 0.052865 0.074888 0.081573 0.303766 0.295204 0.219260 -0.093660 -0.117421 -0.079441 -0.282282 -0.038214 -0.056600 -0.015000 0.282096 0.257308 -0.110668 -0.043965 -0.106970 0.121107 0.155754
polarizability: 3.63638203e+02 8.86444210e+01 3.43671063e+02 4.35709369e+01 -2.79419310e+01 1.99143318e+02
1716.lowfreq: -9.1127 -3.4720 -0.0011 -0.0009 0.0009 2.9764 9.5629 10.5461 21.9349
frequency: 9.4210 10.2741 21.9007 32.1115 37.4422 50.9791 71.5504 80.9954 90.2182 102.8755 107.4779 111.3062 121.4655 129.3552 151.2415 179.2341 194.9783 212.1181 223.2608 231.4645 249.8901 259.8337 264.5928 283.3287 298.9732 307.7713 328.0794 349.6938 390.8545 398.0303 413.3792 431.0812 438.0813 460.7265 475.7464 512.7264 525.5158 537.4629 560.8158 563.7016 601.6741 604.2226 607.6844 637.3137 656.7180 666.3155 695.7268 701.4033 726.7547 731.3108 751.3444 767.7955 774.0040 802.1732 827.2097 831.8516 847.6455 863.4353 879.8005 889.8866 899.9551 902.5780 942.2457 947.4252 966.5063 982.8379 1008.7614 1014.5484 1043.7247 1058.8127 1068.9275 1070.2226 1085.3921 1110.9994 1111.1017 1121.9236 1123.1276 1131.9178 1136.1484 1145.9546 1159.5780 1171.5149 1207.1075 1213.0456 1215.4555 1220.4313 1242.9040 1254.4025 1262.2735 1264.1269 1286.2767 1289.8584 1296.5669 1319.3872 1320.7455 1345.9466 1355.1733 1363.2069 1375.1864 1395.8026 1416.1080 1416.5982 1429.3512 1437.2201 1444.1242 1447.1494 1455.7473 1461.0590 1469.0663 1469.2888 1473.0207 1475.4389 1485.4996 1487.2202 1488.0598 1507.2175 1513.6922 1521.8975 1547.7657 1551.3774 1603.1428 1623.7777 1634.4467 2949.3995 2958.0302 2961.4649 2964.1264 2969.9900 2977.8866 2982.6439 3002.7734 3021.1544 3029.7047 3046.4541 3050.6221 3057.3752 3058.6475 3108.0583 3125.3782 3130.4291 3151.5860 3162.2242 3173.3988 3180.9974 3185.8002 3541.7530 3559.1626
redmass: 5.6633 5.7178 5.0030 3.2761 5.1134 4.5178 3.4552 3.6080 4.3288 1.7221 2.4942 1.4441 5.9514 3.0141 4.8226 3.4823 4.0464 2.7510 1.8726 2.7607 3.1397 5.3645 2.7362 3.9916 5.1324 3.7639 3.9831 3.7358 5.9908 5.2208 3.4242 3.8040 4.3407 2.5843 3.0755 2.0977 4.0577 4.0988 2.9258 1.4438 3.6332 2.7311 3.6884 6.8109 5.6225 5.8974 3.6902 5.2379 3.1211 1.1616 6.5139 1.7590 1.4137 1.8017 1.8815 4.5115 2.1551 3.0847 1.6116 1.4930 4.4889 2.4604 2.4785 1.8092 1.3407 2.1601 3.8383 3.3171 3.3182 2.1301 2.6499 2.4351 2.3281 1.4984 1.4704 1.4425 1.6149 2.0304 1.7495 1.6138 1.7083 1.5448 1.8202 1.6069 1.8659 1.4191 2.9298 1.4543 1.5089 1.2615 1.5725 1.5739 1.2193 2.0300 1.4832 1.3930 1.5678 1.6466 3.6410 5.6165 1.1819 3.5233 1.9311 1.4966 1.1078 2.2722 1.3048 1.2322 1.0623 1.0985 1.2419 1.6599 1.0997 1.1896 1.0460 3.6681 1.4631 6.5516 7.7102 3.2935 6.2175 6.2901 6.7240 1.0651 1.0623 1.0329 1.0632 1.0591 1.0350 1.0633 1.0956 1.0977 1.1006 1.0970 1.1042 1.1025 1.1029 1.0982 1.0994 1.0897 1.0868 1.0874 1.0972 1.0929 1.0960 1.0743 1.0777
irintensity: 0.7282 0.7395 9.6844 1.1336 0.2466 1.4461 5.3439 2.2998 1.4112 0.0856 1.6338 0.8851 1.1453 0.6199 2.3693 4.3861 4.1666 0.3829 0.4680 1.3920 4.3345 6.1949 2.9056 0.8294 6.6922 3.0159 7.5019 4.4911 2.5943 2.0086 3.7118 16.0803 5.9332 19.7853 10.7891 33.7073 1.6271 32.8241 52.9668 87.0510 23.5391 12.3586 1.3841 7.4772 5.2049 3.0728 0.3445 1.8145 0.4860 10.3513 27.5998 18.7984 2.4865 35.9771 45.2457 14.3735 28.4230 2.9616 8.5079 24.7761 58.3003 10.3478 8.7265 16.2023 0.8302 20.8411 14.9242 52.0416 5.1769 31.5458 5.7213 4.6506 2.5701 1.7218 2.6669 4.0133 9.9553 44.3442 57.0277 38.8947 26.0953 27.6354 155.4165 14.6161 131.6689 19.7193 7.9516 31.1037 25.1954 7.5559 9.8931 9.4227 2.3207 15.3928 7.3703 11.0254 8.2130 35.6737 21.9034 41.3415 29.1207 36.8495 28.0529 33.0732 21.3392 100.0064 94.8662 46.8910 11.4699 11.0814 75.4666 21.1737 15.9914 51.4427 16.9666 156.3033 125.7770 126.8893 160.7166 40.6293 54.8493 148.9634 154.3653 35.3113 11.0335 102.4547 55.8386 9.7935 76.6711 54.8582 1.7802 17.2336 27.8761 16.5706 48.1881 25.8683 88.2712 1.9602 24.8420 12.8288 3.4933 0.0594 16.0555 0.3115 11.9961 22.8248 15.3594
temp: 298.150 k
press: 1.00000 atm
elementType: 17 8 8 7 7 7 6 6 6 6 6 6 6 6 6 6 6 6 6 6 6 6 6 6 6 6 6 1 1 1 1 1 1 1 1 1 1 1 1 1 1 1 1 1 1 1 1 1 1 1 1
symmnumber: 1
zpe: 1077976.8 jmol-1
zpe.correction: 0.410580 hartree
zpe.thermalcorrener: 0.437416 hartree
zpe.thermalcorrenthalpy: 0.438361 hartree
zpe.thermalcorrgfe: 0.348716 hartree
zpe.sumelectzpe: -1587.436399 hartree
zpe.sumelectthermal: -1587.409562 hartree
zpe.sumelectthermalent: -1587.408618 hartree
zpe.sumelectthermalfe: -1587.498262 hartree
dipole: 5.4561 -0.4820 -1.0361
dipole: 5.5745
quadrupole: -195.1232 -136.9633 -161.4367
quadrupole: -8.7555 -28.2877 -3.6037
quadrupole: -30.6155 27.5444 3.0710 -8.7555 -28.2877 -3.6037
hfenergy: -1587.8469785 hartree
pointgroup: C01 [X(C21H24Cl1N3O2)]
dipole: -2.1434576 -0.2793456 -0.3708962 debye
polarizability: 326.6476061|81.6079018|381.4920051|-55.4531833|4.5810594|198.312973 unknown
InChI: InChI=1S/C21H24ClN3O2/c1-23-20(26)6-4-3-5-11-24-21-16-9-7-14(22)12-19(16)25-18-10-8-15(27-2)13-17(18)21/h7-10,12-13,23-24H,3-6,11H2,1-2H3
charge 0 multiplicity 1
51 atoms
Cl 5.906518 3.868488 -1.463655
O  -0.413561 -4.204204 0.963057
O  -6.463262 -0.355167 0.531531
N  0.410667 0.781593 1.565394
N  3.483949 -0.684981 -1.064494
N  -6.866666 0.376388 -1.642293
C  -1.782706 1.954758 1.631274
C  -2.403826 1.315987 0.368145
C  -0.245518 2.106315 1.56518
C  -3.932776 1.141464 0.488024
C  1.444333 0.333221 0.750887
C  1.478459 -1.067479 0.378198
C  2.496137 1.187416 0.267821
C  -4.558353 0.499711 -0.770645
C  2.532905 -1.513344 -0.519712
C  3.464288 0.62497 -0.674857
C  0.511498 -2.021679 0.827162
C  2.698136 2.543937 0.708081
C  2.578184 -2.900825 -0.887004
C  4.494036 1.47806 -1.216235
C  0.591628 -3.366548 0.450624
C  -6.035255 0.140414 -0.555987
C  1.643472 -3.817739 -0.41584
C  3.722987 3.338878 0.20157
C  4.59619 2.789253 -0.788288
C  -8.296597 0.045184 -1.626867
C  -0.378402 -5.622502 0.597046
H  -2.218877 2.960899 1.790497
H  -2.05772 1.358626 2.527743
H  -1.935346 0.328865 0.176837
H  -2.162005 1.947658 -0.511956
H  0.032662 2.64189 0.639467
H  0.096102 2.720466 2.424442
H  -4.180994 0.501194 1.355434
H  -4.409669 2.12411 0.678259
H  -0.137496 0.053363 2.025581
H  -4.017975 -0.442276 -0.996722
H  -4.432166 1.160984 -1.650916
H  -0.33111 -1.752381 1.47376
H  2.068268 2.96241 1.49567
H  3.388182 -3.204971 -1.556693
H  5.18197 1.037451 -1.941753
H  1.712864 -4.868107 -0.713461
H  3.874463 4.360529 0.560133
H  -6.463446 0.786534 -2.485601
H  -8.546452 -0.699634 -2.405136
H  -8.920327 0.94571 -1.778034
H  -8.521642 -0.38277 -0.636674
H  0.55139 -6.108669 0.95071
H  -1.244885 -6.068824 1.106568
H  -0.478954 -5.761123 -0.496872
