program: Gaussian 09
title: 000154979
version: EM64L-G09RevD.01
frameworkgroup: C1[X(C19H20ClN3O2)]
method: RPBEPBE
basis: SDD
operation: Freq
keyword: #p
keyword: freq=noraman
keyword: PBEPBE/SDD
title: #p freq=noraman PBEPBE/SDD
converged: YES YES NO NO
title: Mulliken charges:
elementType: Cl O O N N N C C C C C C C C C C C C C C C C C C C H H H H H H H H H H H H H H H H H H H H
charge: -0.064014 -0.273225 -0.258127 -0.418445 -0.052263 -0.618763 0.306873 -0.455206 -0.379807 0.293526 -0.356609 0.228240 -0.115156 -0.079228 -0.502532 -0.495486 -0.286916 -0.320824 -0.302852 0.286269 -0.357224 -0.298075 -0.106099 0.231097 -0.536531 0.215666 0.195680 0.216239 0.248084 0.218380 0.251215 0.300194 0.232413 0.204213 0.207687 0.248377 0.265358 0.288308 0.246904 0.253124 0.312858 0.336214 0.223802 0.223211 0.243449
chargesum: 0.00000
title: Mulliken charges with hydrogens summed into heavy atoms:
elementType: Cl O O N N N C C C C C C C C C C C C C C C C C C C
charge: -0.064014 -0.273225 -0.258127 -0.118251 -0.052263 0.030309 0.306873 -0.043859 0.084516 0.293526 0.112986 0.228240 -0.115156 -0.079228 -0.065906 -0.287799 -0.038539 -0.055465 -0.014544 0.286269 -0.110321 -0.044951 -0.106099 0.231097 0.153931
polarizability: 3.71716658e+02 8.50259248e+01 2.99144129e+02 -3.61567886e+01 3.77591481e+01 1.64022363e+02
1716.lowfreq: -7.8451 -0.0011 -0.0005 0.0013 2.7474 6.9833 9.4436 15.2405 24.2001
frequency: 6.7042 15.1733 24.1988 35.9113 54.1544 64.4648 76.3462 91.8540 105.6043 117.7208 122.8850 130.8137 167.2406 198.9824 214.2025 224.4090 244.6468 261.8532 263.6714 282.3351 293.8256 317.7224 340.6812 374.6676 396.1895 403.4391 421.1216 437.5188 455.7016 461.9009 498.6563 503.8798 521.7389 532.4221 537.7612 559.4445 595.7766 601.7661 607.4474 637.0639 656.6158 667.1078 676.3717 701.5968 726.6120 741.0646 751.3917 766.9900 801.2054 820.9916 827.0354 844.7221 847.2390 853.1778 889.4561 894.8424 902.1529 942.0119 946.1169 966.8163 978.0556 1014.4103 1035.2335 1043.8263 1060.1470 1067.5312 1084.5591 1108.3009 1110.4765 1124.1201 1133.2240 1145.5738 1167.6667 1172.1769 1209.0168 1215.8509 1224.3232 1243.8473 1254.1007 1263.8949 1276.6020 1284.2444 1292.7446 1316.3730 1320.8209 1346.5955 1361.3236 1371.0872 1375.8149 1397.2204 1417.4294 1430.5626 1437.8870 1445.4829 1448.8186 1464.0289 1467.9800 1473.3762 1476.4090 1485.6583 1488.0065 1508.2178 1523.2588 1548.4909 1553.4935 1596.9397 1604.4438 1634.7411 1645.4093 2945.3469 2955.2830 2961.5621 2971.7980 2991.7523 3016.8621 3025.6879 3044.5858 3050.6024 3064.0591 3123.5949 3131.3420 3151.3634 3163.6667 3173.2826 3180.0911 3188.8228 3516.2654 3541.8443 3673.3947
redmass: 6.3900 6.5852 5.2380 5.7944 3.5490 4.6634 3.7073 2.3542 3.7567 4.0800 5.7405 4.6144 4.2422 3.7754 1.7402 2.8690 3.3100 5.0073 2.9501 3.9231 3.8307 4.5087 3.9182 3.6130 5.8122 3.8932 3.6234 4.3138 2.2351 2.6477 1.4936 1.7617 2.7627 2.6468 4.2115 3.1271 1.8916 4.2623 4.4945 7.1678 5.6649 5.6318 2.1313 6.0424 3.0686 1.1975 6.5311 1.7697 1.8383 2.4762 1.8825 2.4717 2.3754 2.9792 1.5136 1.9347 4.9215 1.9724 2.3190 1.3413 2.2331 3.4612 3.3536 1.7644 2.1762 3.0140 2.3473 1.8978 1.2558 1.7411 2.0696 1.5994 1.5504 1.5531 2.0065 1.6252 1.3972 2.8102 1.4279 1.5284 1.2420 1.5077 1.9945 1.4374 2.2589 1.4065 1.7343 2.1695 3.6812 5.5822 3.5969 1.8534 1.5359 1.1173 2.2647 1.2967 1.0507 1.1295 1.8652 1.1028 1.1688 3.6258 6.7265 7.5394 3.2864 1.4308 6.1952 6.7584 3.5966 1.0652 1.0666 1.0329 1.0591 1.0631 1.0924 1.1002 1.0966 1.1042 1.1028 1.0994 1.0894 1.0869 1.0879 1.0973 1.0931 1.0954 1.0448 1.0745 1.1042
irintensity: 0.2212 0.3866 13.5497 1.1062 2.7779 0.9679 4.4986 1.3219 1.8943 7.6265 0.7198 2.8608 1.4910 4.7761 1.0004 1.3152 1.0248 5.7683 2.6344 0.2379 2.2475 1.3132 3.1993 5.2887 1.5765 3.1342 10.0762 2.1535 35.4905 10.8503 35.7205 88.1807 61.0217 51.9073 29.2277 42.8039 58.9465 14.5775 6.7333 6.2917 4.2872 2.2664 47.3515 2.3347 0.0351 13.6039 27.2472 19.0891 33.4342 11.4559 41.7445 7.4839 17.7433 11.6356 23.0364 13.8010 56.6042 4.9315 15.7702 0.8200 20.9701 60.2041 7.7624 2.4349 28.7685 3.9513 0.7777 5.9103 0.1592 9.5688 49.3037 37.6137 33.2620 34.0612 182.3597 36.2176 24.7697 6.5963 13.7810 34.1263 5.6952 27.4124 13.8474 34.8560 9.5530 11.8377 73.7307 66.2133 25.0315 45.2230 28.2833 27.3666 35.8428 9.5936 107.4546 69.2433 13.2496 66.0980 23.1333 18.3540 41.8900 159.6790 122.6169 161.6689 36.7962 61.5491 52.4746 136.2103 278.5935 31.3972 63.4528 99.4280 21.9037 27.9672 39.2718 6.7767 17.0275 46.6956 45.3337 27.4076 15.0073 3.6598 0.0427 15.8888 0.3821 12.2555 29.4069 21.5004 21.8901
temp: 298.150 k
press: 1.00000 atm
elementType: 17 8 8 7 7 7 6 6 6 6 6 6 6 6 6 6 6 6 6 6 6 6 6 6 6 1 1 1 1 1 1 1 1 1 1 1 1 1 1 1 1 1 1 1 1
symmnumber: 1
zpe: 932766.7 jmol-1
zpe.correction: 0.355272 hartree
zpe.thermalcorrener: 0.379096 hartree
zpe.thermalcorrenthalpy: 0.380040 hartree
zpe.thermalcorrgfe: 0.297731 hartree
zpe.sumelectzpe: -1508.994970 hartree
zpe.sumelectthermal: -1508.971146 hartree
zpe.sumelectthermalent: -1508.970202 hartree
zpe.sumelectthermalfe: -1509.052511 hartree
dipole: 8.5555 1.2369 -4.5262
dipole: 9.7577
quadrupole: -140.5907 -137.8253 -160.6302
quadrupole: 10.6389 -4.3749 18.3817
quadrupole: 5.7580 8.5235 -14.2815 10.6389 -4.3749 18.3817
hfenergy: -1509.350242 hartree
pointgroup: C01 [X(C19H20Cl1N3O2)]
dipole: -3.1708812 -0.9964334 -1.921025 debye
polarizability: 337.9425846|91.7989399|331.363101|50.7955842|-22.9314524|165.5774639 unknown
InChI: InChI=1S/C19H20ClN3O2/c1-25-13-6-8-16-15(11-13)19(22-9-3-2-4-18(21)24)14-7-5-12(20)10-17(14)23-16/h5-8,10-11,22H,2-4,9,21H2,1H3
charge 0 multiplicity 1
45 atoms
Cl 6.053379 2.694171 1.112946
O  -2.060107 -3.768993 -0.733778
O  -4.582821 2.534702 2.138265
N  -0.220159 0.913896 -1.442968
N  2.697246 -1.231957 0.881893
N  -6.222245 1.286293 1.076659
C  0.759537 0.249303 -0.713297
C  -2.110068 2.526612 -1.469816
C  -0.574771 2.347696 -1.42791
C  0.52471 -1.13405 -0.348047
C  -2.822554 2.080109 -0.174637
C  2.004495 0.852111 -0.317762
C  1.541449 -1.821531 0.432429
C  2.916131 0.066587 0.516152
C  -4.360419 2.182136 -0.287219
C  -0.668421 -1.844108 -0.694533
C  2.444776 2.155545 -0.745576
C  1.323178 -3.196689 0.783386
C  4.149729 0.66378 0.965814
C  -0.845194 -3.183637 -0.333536
C  0.167941 -3.876655 0.410543
C  3.656516 2.699657 -0.32813
C  4.485976 1.940463 0.554657
C  -5.044225 2.018294 1.07875
C  -2.30116 -5.166023 -0.363682
H  -2.324659 3.597694 -1.65692
H  -2.516599 1.976306 -2.346522
H  -0.127357 2.879624 -2.293659
H  -0.174937 2.8091 -0.506741
H  -2.538403 1.041101 0.083085
H  -2.498035 2.710376 0.67413
H  -0.931708 0.319197 -1.869762
H  -4.630047 3.189768 -0.665197
H  -4.75155 1.448684 -1.019428
H  -1.498007 -1.376489 -1.236414
H  1.843471 2.733195 -1.449708
H  2.111829 -3.686449 1.362347
H  4.793494 0.061462 1.611154
H  0.037387 -4.924777 0.69515
H  3.98135 3.684558 -0.674457
H  -6.589431 0.850047 0.233175
H  -6.728145 1.176279 1.955777
H  -2.311472 -5.297898 0.7356
H  -1.546509 -5.840341 -0.812805
H  -3.294691 -5.401749 -0.772711
