program: Gaussian 09
title: 000154978
version: EM64L-G09RevD.01
frameworkgroup: C1[X(C17H16ClN3O2)]
method: RPBEPBE
basis: SDD
operation: Freq
keyword: #p
keyword: freq=noraman
keyword: PBEPBE/SDD
title: #p freq=noraman PBEPBE/SDD
converged: YES YES NO NO
title: Mulliken charges:
elementType: Cl O O N N N C C C C C C C C C C C C C C C C C H H H H H H H H H H H H H H H H
charge: -0.062520 -0.271490 -0.259831 -0.417224 -0.050328 -0.614469 0.293148 0.295451 0.225863 -0.116031 -0.080597 -0.358227 -0.498835 -0.296403 -0.320594 -0.554173 -0.301404 0.289570 -0.356911 -0.292097 -0.108533 0.245060 -0.536348 0.297929 0.259588 0.250622 0.209714 0.256335 0.265518 0.228981 0.233846 0.288133 0.247389 0.256433 0.223843 0.222484 0.245460 0.319405 0.341242
chargesum: 0.00000
title: Mulliken charges with hydrogens summed into heavy atoms:
elementType: Cl O O N N N C C C C C C C C C C C C C C C C C
charge: -0.062520 -0.271490 -0.259831 -0.119294 -0.050328 0.046178 0.293148 0.295451 0.225863 -0.116031 -0.080597 0.151984 -0.289121 -0.040068 -0.055076 -0.091346 -0.013271 0.289570 -0.109522 -0.035665 -0.108533 0.245060 0.155439
polarizability: 3.98779091e+02 -3.02976867e+00 2.63413493e+02 9.34971145e+00 -2.26725132e+01 1.19779762e+02
1716.lowfreq: -3.0834 -0.0014 -0.0013 -0.0010 3.4168 5.0126 17.0494 30.2688 33.5549
frequency: 16.9598 30.2236 33.5506 40.0602 63.5556 75.5819 104.9490 114.2525 119.9033 151.5106 167.8908 184.5934 216.9811 225.4684 242.9445 258.1204 265.1751 286.3342 328.0670 342.0709 393.5939 401.4402 419.6534 430.9199 442.3318 459.6473 498.1566 505.1161 513.2540 537.3232 537.6019 559.4282 590.4111 600.8648 606.1980 638.9499 657.5511 664.5963 681.0160 698.4032 727.0124 749.6114 768.2052 801.7766 811.8266 827.1432 837.6067 847.3411 867.2108 889.9266 901.0546 947.1892 949.5701 967.3619 1011.7467 1012.8234 1040.4723 1056.6074 1075.3309 1086.8180 1110.0634 1124.8718 1135.8164 1145.9024 1170.8272 1189.7768 1212.8332 1216.6364 1243.0449 1259.0594 1267.8547 1290.5233 1294.3106 1321.2620 1348.4556 1368.0744 1377.7956 1396.5560 1417.4937 1430.9686 1437.9773 1444.4316 1449.1288 1468.3498 1473.3328 1476.0287 1493.3315 1508.4634 1522.5242 1548.1544 1553.5201 1598.2457 1603.8772 1634.6945 1645.9250 2961.7922 2975.8942 2990.4116 3043.1603 3051.1876 3073.0053 3124.5627 3131.9437 3151.1045 3163.8397 3172.9500 3180.5478 3186.6209 3516.1557 3544.1983 3672.3062
redmass: 4.7896 5.1553 6.9076 7.8330 3.2096 3.5594 3.9892 6.8749 4.0965 3.0425 6.1213 4.0104 1.8753 3.2081 3.8270 5.7816 2.7886 4.6604 5.1850 4.6911 6.6626 4.5396 3.2902 3.3845 3.9900 2.4154 1.7330 1.7975 2.9056 3.4762 2.0988 3.1302 3.3509 3.0197 3.5710 5.2403 5.1559 5.7938 2.2978 6.1636 3.1311 6.0290 1.8045 1.7768 1.3682 1.8744 5.9539 2.1910 3.4288 1.4983 5.6382 3.7480 1.5332 1.3415 2.3137 3.5898 2.9923 2.3516 2.7608 2.0027 1.2557 1.7287 2.1666 1.5849 1.4901 1.3124 2.4522 1.6279 2.9790 1.4301 1.6474 2.9918 1.1871 2.2320 1.8198 2.2944 3.2590 5.3650 3.5659 1.8460 1.6860 1.1332 2.2842 1.0507 1.2703 2.0322 1.1397 3.7045 6.5421 8.1553 3.1222 1.4839 6.1723 6.7212 3.2958 1.0328 1.0611 1.0633 1.0975 1.1042 1.1030 1.0995 1.0897 1.0870 1.0875 1.0973 1.0931 1.0962 1.0450 1.0746 1.1043
irintensity: 6.0478 5.7546 4.9021 0.3296 2.9622 7.6309 2.8511 1.1984 1.5382 0.5969 2.7962 6.0715 0.2886 0.3414 1.3431 4.6955 2.3175 0.3423 1.8235 9.4672 2.9426 4.8524 9.8843 9.3928 0.5640 23.0600 25.4227 45.4029 23.3604 85.8283 64.4114 40.4685 37.8536 31.3459 25.7052 2.3150 4.7490 10.8624 49.0634 2.0823 0.0973 27.8482 20.4935 35.1540 6.3620 42.9306 19.7655 26.5055 4.1679 23.7228 67.4484 17.6886 10.6132 0.9119 4.3099 70.7255 7.3552 22.1810 9.8627 9.2435 0.1535 9.2108 69.1001 36.7577 36.3769 39.9838 222.6717 5.7128 7.1258 10.5892 38.3503 15.4001 14.9683 10.9820 96.4879 239.3888 13.5733 36.0711 29.2217 27.6257 58.1213 11.1519 88.2949 13.6263 88.8837 21.2662 39.4914 157.1488 125.4822 155.9185 70.1308 54.3369 51.2351 150.8386 293.1086 103.2845 8.8417 15.9945 8.9510 46.7002 22.0960 26.7971 12.9217 3.8837 0.1127 16.0137 0.3304 10.0144 39.7788 20.8952 24.5079
temp: 298.150 k
press: 1.00000 atm
elementType: 17 8 8 7 7 7 6 6 6 6 6 6 6 6 6 6 6 6 6 6 6 6 6 1 1 1 1 1 1 1 1 1 1 1 1 1 1 1 1
symmnumber: 1
zpe: 785953.0 jmol-1
zpe.correction: 0.299354 hartree
zpe.thermalcorrener: 0.320491 hartree
zpe.thermalcorrenthalpy: 0.321436 hartree
zpe.thermalcorrgfe: 0.246848 hartree
zpe.sumelectzpe: -1430.548452 hartree
zpe.sumelectthermal: -1430.527314 hartree
zpe.sumelectthermalent: -1430.526370 hartree
zpe.sumelectthermalfe: -1430.600958 hartree
dipole: 6.9485 4.0454 2.4055
dipole: 8.3925
quadrupole: -130.0423 -133.3262 -140.5434
quadrupole: -6.1000 1.9778 16.7799
quadrupole: 4.5950 1.3111 -5.9061 -6.1000 1.9778 16.7799
hfenergy: -1430.8478059 hartree
pointgroup: C01 [X(C17H16Cl1N3O2)]
dipole: 1.3755539 -2.8812491 -0.8417467 debye
polarizability: 359.1964231|-62.4939022|301.0629057|-20.5961582|-20.5611357|121.7130171 unknown
InChI: InChI=1S/C17H16ClN3O2/c1-23-11-3-5-14-13(9-11)17(20-7-6-16(19)22)12-4-2-10(18)8-15(12)21-14/h2-5,8-9,20H,6-7,19H2,1H3
charge 0 multiplicity 1
39 atoms
Cl -3.172484 5.147787 -0.404522
O  4.324081 -2.221542 0.282945
O  -4.24872 -3.589087 0.804017
N  -0.643228 -1.258614 0.814524
N  1.199549 2.38837 -0.532979
N  -3.555821 -4.669189 -1.128945
C  -0.074534 -0.049981 0.42247
C  1.352036 -0.004065 0.172868
C  -0.8298 1.163705 0.266715
C  1.928293 1.251061 -0.285064
C  -0.139363 2.341626 -0.261113
C  -1.998252 -1.760694 0.520001
C  2.212224 -1.136671 0.328144
C  -2.207236 1.314184 0.662172
C  3.343617 1.30921 -0.521357
C  -1.930609 -3.238414 0.066426
C  -0.888155 3.553908 -0.484295
C  3.587226 -1.039844 0.090616
C  4.166701 0.202985 -0.334405
C  -2.900963 2.506587 0.473995
C  -2.224664 3.610492 -0.133009
C  -3.342775 -3.833814 -0.045885
C  5.769636 -2.174835 0.046965
H  0.009915 -1.969127 1.147079
H  -2.671535 -1.705532 1.396844
H  -2.441733 -1.148394 -0.283867
H  1.84163 -2.12402 0.625021
H  -2.725697 0.497444 1.16841
H  3.746248 2.27005 -0.855649
H  -1.3686 -3.326085 -0.881553
H  -1.389298 -3.831427 0.832511
H  -0.351713 4.405509 -0.90935
H  5.241488 0.286109 -0.520333
H  -3.940604 2.609712 0.796042
H  6.267881 -1.457023 0.726851
H  6.000563 -1.914681 -1.004186
H  6.125721 -3.193147 0.26152
H  -2.836176 -4.853612 -1.825429
H  -4.471047 -5.108939 -1.230396
