program: Gaussian 09
title: 000154976
version: EM64L-G09RevD.01
frameworkgroup: C1[X(C18H17ClN2O3)]
method: RPBEPBE
basis: SDD
operation: Freq
keyword: #p
keyword: freq=noraman
keyword: PBEPBE/SDD
title: #p freq=noraman PBEPBE/SDD
converged: YES YES NO NO
title: Mulliken charges:
elementType: Cl O O O N N C C C C C C C C C C C C C C C C C C H H H H H H H H H H H H H H H H H
charge: -0.062549 -0.279815 -0.298168 -0.218734 -0.427988 -0.052698 0.297149 0.276227 0.246141 -0.117535 -0.080431 -0.360007 -0.466841 -0.283112 -0.322695 -0.555201 -0.302796 0.278580 -0.360183 -0.301756 -0.107779 0.265964 -0.536444 -0.503703 0.342460 0.259822 0.227735 0.220713 0.228517 0.265762 0.249527 0.249845 0.289231 0.247505 0.253100 0.225401 0.222820 0.243923 0.242816 0.252198 0.252999
chargesum: 0.00000
title: Mulliken charges with hydrogens summed into heavy atoms:
elementType: Cl O O O N N C C C C C C C C C C C C C C C C C C
charge: -0.062549 -0.279815 -0.298168 -0.218734 -0.085529 -0.052698 0.297149 0.276227 0.246141 -0.117535 -0.080431 0.127550 -0.246128 -0.054594 -0.056933 -0.055829 -0.013565 0.278580 -0.112678 -0.048656 -0.107779 0.265964 0.155701 0.244309
polarizability: 3.95937034e+02 -4.78862508e+01 2.69624799e+02 -9.23153866e+00 -2.39647031e+01 1.23288751e+02
1716.lowfreq: -3.2039 -0.0006 0.0008 0.0016 3.2411 4.6682 15.9204 28.8779 35.2352
frequency: 15.7800 28.8693 35.1933 52.6292 62.9975 79.0023 95.9183 101.4665 114.7294 122.6075 131.9002 168.8477 179.3287 205.0126 218.9883 225.0059 258.7610 263.1409 267.6910 281.7983 303.5496 328.6415 353.2180 392.5032 399.9740 413.7260 424.9312 438.3642 454.5307 516.2719 521.5781 537.1065 563.7119 589.8291 603.2175 608.6125 638.6757 659.0599 663.5527 696.1313 715.7630 727.6253 753.7067 764.3687 775.6149 800.7993 826.5540 830.5998 853.8772 874.7574 891.4700 901.0289 927.4377 938.9366 953.8342 965.8108 1005.9072 1019.8751 1046.2490 1057.3178 1063.6561 1111.0755 1118.0509 1122.8028 1128.9891 1146.3385 1156.0388 1158.7061 1174.9611 1209.2079 1215.0485 1221.7222 1243.0796 1256.5480 1270.0004 1293.6425 1320.6803 1328.6630 1357.4252 1373.1800 1399.9910 1418.7740 1428.6738 1434.4702 1445.1881 1450.5747 1454.5919 1456.3646 1466.3864 1468.5366 1474.1737 1479.3210 1494.6549 1513.3025 1523.5670 1549.2742 1571.9390 1607.7474 1635.6233 1665.4945 2962.4937 2965.0850 3010.1193 3019.8604 3034.7987 3051.9592 3106.3056 3118.7598 3123.7188 3147.3656 3150.3084 3151.3556 3166.8026 3173.3090 3181.9633 3201.6386 3512.1693
redmass: 6.6786 5.0228 6.1890 6.2491 4.7402 3.6379 2.6306 2.5607 1.7309 5.9457 4.1028 4.4551 2.8036 4.0835 1.6252 4.1634 5.5349 2.8161 3.1325 4.1811 5.1446 4.6197 4.7959 5.7014 4.4254 3.0744 3.5963 5.3807 2.4811 2.2529 4.2694 4.4524 3.1247 5.0844 4.9715 3.7336 6.4612 5.7696 6.0623 6.4466 3.8101 3.1578 6.0933 1.8476 3.9053 2.0116 2.0083 4.2918 1.9668 2.3023 1.5017 5.7541 4.4684 1.3369 5.8038 1.3408 3.8062 3.2622 3.1605 2.2668 2.0492 1.2570 1.2659 1.8312 2.2647 1.5743 1.4461 2.2741 1.7570 1.3266 2.2299 1.6555 2.7148 1.5190 1.5502 3.0530 2.1165 1.3725 1.4152 4.5748 6.2388 3.3019 1.1871 1.3558 3.0573 1.1863 2.0799 1.0759 1.0540 1.0504 1.0762 2.7955 1.0955 4.1400 6.8916 8.1113 2.1466 4.7270 6.1889 8.6909 1.0329 1.0603 1.0287 1.0858 1.0776 1.1043 1.1023 1.1053 1.0996 1.0897 1.1063 1.0870 1.0895 1.0973 1.0931 1.0928 1.0750
irintensity: 0.6163 0.1457 0.1121 2.2809 0.1748 6.3904 0.5736 1.6516 0.7873 1.7904 0.5327 2.0835 18.4619 2.9357 1.1591 2.0521 4.4854 4.1147 10.9494 0.3759 1.3509 4.2621 8.6570 3.0080 4.3387 10.3775 0.7705 3.3833 15.2144 18.4549 4.0411 29.8649 44.4714 8.4862 5.8045 20.4379 9.7006 6.0504 7.3390 1.8377 5.2047 0.8281 24.5134 42.9410 5.5499 25.1940 39.6475 13.6875 36.4971 4.8536 24.8296 72.7910 4.9566 1.2156 50.9795 0.9854 2.7335 105.9603 1.8281 15.9276 20.8705 0.3346 0.6871 24.2193 25.9643 24.4785 17.2587 135.8340 98.3976 64.8205 128.8391 12.3022 1.9997 21.7328 26.3841 15.9941 18.5188 12.4396 42.9690 30.5344 54.2810 24.2322 13.5986 28.1328 111.6388 37.0530 139.1849 29.6859 12.3241 12.2136 46.8440 13.3553 16.1616 165.3299 126.1204 153.4176 111.1113 59.2910 142.6454 187.1617 111.3358 41.1743 20.3924 3.7178 27.1547 45.6678 6.7789 26.7276 26.9387 5.4097 5.5076 3.4700 0.2989 15.6795 0.6627 13.7692 90.6349
temp: 298.150 k
press: 1.00000 atm
elementType: 17 8 8 8 7 7 6 6 6 6 6 6 6 6 6 6 6 6 6 6 6 6 6 6 1 1 1 1 1 1 1 1 1 1 1 1 1 1 1 1 1
symmnumber: 1
zpe: 825033.7 jmol-1
zpe.correction: 0.314239 hartree
zpe.thermalcorrener: 0.336721 hartree
zpe.thermalcorrenthalpy: 0.337665 hartree
zpe.thermalcorrgfe: 0.260422 hartree
zpe.sumelectzpe: -1489.628458 hartree
zpe.sumelectthermal: -1489.605975 hartree
zpe.sumelectthermalent: -1489.605031 hartree
zpe.sumelectthermalfe: -1489.682274 hartree
dipole: 6.4362 1.1424 -1.9215
dipole: 6.8134
quadrupole: -143.4607 -132.2982 -153.3479
quadrupole: -19.8316 2.2479 -12.3727
quadrupole: -0.4251 10.7374 -10.3123 -19.8316 2.2479 -12.3727
hfenergy: -1489.9426963 hartree
pointgroup: C01 [X(C18H17Cl1N2O3)]
dipole: -2.4991048 0.6044927 0.7580306 debye
polarizability: 402.8944289|37.01167|259.2226542|-0.9508976|33.5097336|126.7335008 unknown
InChI: InChI=1S/C18H17ClN2O3/c1-23-12-4-6-15-14(10-12)18(20-8-7-17(22)24-2)13-5-3-11(19)9-16(13)21-15/h3-6,9-10,20H,7-8H2,1-2H3
charge 0 multiplicity 1
41 atoms
Cl 6.425121 -0.629331 -0.339961
O  -4.043662 -1.67243 0.211674
O  -2.792111 2.614963 0.146945
O  -1.921848 4.185683 -1.346715
N  -0.160754 1.477814 0.947063
N  1.512113 -2.216523 -0.501229
C  0.439076 0.301978 0.508924
C  -0.431283 -0.823744 0.217277
C  1.856809 0.121627 0.333305
C  0.167466 -2.051679 -0.278601
C  2.325657 -1.161123 -0.200016
C  0.321982 2.864215 0.826346
C  -1.853577 -0.771063 0.364705
C  2.857115 1.096501 0.688509
C  -0.691235 -3.162894 -0.579929
C  -0.875454 3.854146 0.877297
C  3.737778 -1.363403 -0.414466
C  -2.658008 -1.868956 0.047348
C  -2.072555 -3.090191 -0.425965
C  4.21746 0.870566 0.495569
C  4.637015 -0.369267 -0.077616
C  -1.884679 3.618216 -0.236227
C  -4.932881 -2.801489 -0.075685
C  -3.808462 2.22077 -0.867401
H  -1.171767 1.42099 1.089579
H  0.882527 2.997111 -0.118982
H  0.994455 3.141792 1.661984
H  -2.379347 0.12017 0.721004
H  2.568922 2.038824 1.154875
H  -0.204802 -4.072798 -0.943856
H  -1.383325 3.762877 1.85379
H  -0.483546 4.879044 0.77548
H  4.047329 -2.324509 -0.831462
H  -2.694901 -3.955894 -0.670692
H  4.958638 1.621121 0.782971
H  -4.712617 -3.666357 0.579208
H  -4.865256 -3.110605 -1.13675
H  -5.9459 -2.428558 0.135841
H  -4.543884 3.033642 -0.983696
H  -3.319735 2.021609 -1.834873
H  -4.276372 1.311656 -0.463973
