program: Gaussian 09
title: 000154971
version: EM64L-G09RevD.01
frameworkgroup: C1[X(C15H21NO3)]
method: RPBEPBE
basis: SDD
operation: Freq
keyword: #p
keyword: freq=noraman
keyword: PBEPBE/SDD
title: #p freq=noraman PBEPBE/SDD
converged: YES YES NO NO
title: Mulliken charges:
elementType: O O O N C C C C C C C C C C C C C C C H H H H H H H H H H H H H H H H H H H H H
charge: -0.276018 -0.412200 -0.235038 -0.094531 -0.364481 -0.357370 -0.396970 -0.390223 -0.399660 -0.489456 0.473471 -0.508718 -0.480728 0.356485 -0.193915 -0.399414 -0.261879 -0.502350 0.215237 0.175187 0.236212 0.208741 0.166665 0.195289 0.203624 0.200731 0.191019 0.213895 0.189464 0.194163 0.220368 0.283646 0.234757 0.223983 0.249862 0.234387 0.215214 0.237498 0.265896 0.377158
chargesum: 0.00000
title: Mulliken charges with hydrogens summed into heavy atoms:
elementType: O O O N C C C C C C C C C C C C C C C
charge: -0.276018 -0.035043 -0.235038 -0.094531 0.046918 0.018036 0.001943 0.001527 0.003698 -0.074925 0.473471 -0.225072 -0.245971 0.356485 0.030068 -0.149553 0.187722 0.001044 0.215237
polarizability: 2.11037437e+02 7.97665261e-01 1.83328984e+02 2.75104911e+00 1.31954208e+01 1.34219336e+02
1716.lowfreq: -15.2975 -2.1147 -1.2422 -0.0006 0.0004 0.0008 20.5479 21.5551 33.4435
frequency: 19.8100 21.1473 33.4247 39.9997 49.8222 61.4992 104.4284 110.0397 170.1823 201.2921 235.0402 237.1077 250.1072 277.9510 289.1324 302.4482 319.2994 384.1498 419.0841 442.0849 444.0426 452.2923 462.1625 509.1779 548.2660 562.4022 570.6432 606.6788 621.2693 657.9981 696.0754 723.0352 760.4026 791.5290 797.6609 801.4252 850.3768 852.1353 860.6338 883.6892 899.9149 907.1736 955.1730 965.1024 971.7917 983.8347 989.6805 996.4400 1002.0853 1023.3302 1046.5265 1046.9963 1076.5139 1082.4860 1105.6073 1111.7816 1120.3284 1145.0484 1151.3365 1160.3164 1172.1290 1190.7949 1195.9830 1237.3427 1245.0903 1252.4703 1262.5835 1266.0077 1270.9405 1292.1154 1295.4373 1327.3944 1335.0021 1338.3298 1348.6703 1364.1151 1369.4128 1378.8733 1385.7823 1396.6904 1428.3364 1437.3281 1449.3787 1454.9624 1459.4586 1466.1528 1466.7076 1470.4561 1479.3703 1482.3816 1603.3933 1607.5407 1672.3305 2819.1642 2828.7590 2850.4193 2966.4628 2973.8805 2981.1911 2983.0502 2986.0776 3010.1520 3018.1306 3032.8905 3039.2744 3041.4403 3044.8222 3053.9327 3096.1046 3121.7577 3143.5721 3153.3347 3168.6701 3511.0863
redmass: 3.8684 5.5786 6.6389 5.6499 3.7462 3.8177 3.8590 5.1794 2.9214 3.5066 2.5471 2.6526 2.9694 2.7783 3.3763 2.6318 2.6890 1.7413 3.7826 3.0480 2.8515 3.4096 2.8727 2.4584 2.8411 2.6862 4.1132 3.7632 3.2741 1.5588 2.2970 4.4906 3.2399 1.5412 3.1570 1.5068 2.1597 1.7162 2.8272 1.4622 1.6299 1.8229 1.2933 3.1293 1.3317 5.2855 2.1398 2.3906 2.6886 1.8233 2.3463 2.5281 1.6339 1.4087 2.0802 2.2199 2.4944 1.7074 1.4905 1.9119 1.2191 1.2788 1.1581 1.3140 1.7896 1.7119 1.2153 1.6734 1.3980 1.3550 1.4039 1.3031 1.4595 1.4430 1.5117 1.4581 1.5386 1.9582 1.5447 3.5599 1.0928 2.4537 1.0928 1.1254 1.0878 1.0932 1.2678 1.1507 1.1213 1.7288 6.8537 6.2933 8.3614 1.0714 1.0708 1.0697 1.0626 1.0564 1.0849 1.0631 1.0614 1.0659 1.0872 1.0953 1.1069 1.0884 1.1030 1.1037 1.0953 1.0871 1.0926 1.0902 1.0974 1.0639
irintensity: 0.7942 0.3271 1.2834 1.2857 0.2352 0.1092 1.2223 2.2207 0.8055 0.6865 3.5172 1.6171 1.9469 2.0814 0.8566 7.1163 1.1263 3.0511 1.2046 3.7119 0.5779 15.1636 5.9214 41.5790 1.4182 0.3336 22.2537 6.1524 20.6945 120.9796 21.0267 20.6611 6.5359 54.9551 5.7153 1.7335 2.7059 4.8092 6.7016 9.9577 14.7449 5.7587 3.3432 45.8931 0.4270 3.6452 15.8191 25.4723 43.4039 72.4735 50.4306 127.8698 14.7391 2.6784 104.9644 14.6280 3.8513 34.2475 15.1588 78.1014 7.9872 1.8737 4.9827 49.8766 49.7209 37.0152 5.6768 5.2233 29.1531 11.2673 15.2401 16.6740 12.4985 1.6390 2.3281 1.5841 23.0011 31.2349 12.8389 31.5897 32.1940 43.8858 8.1745 19.5468 12.1890 8.1830 65.9752 8.9033 7.3162 3.0140 25.3337 109.0775 200.5292 51.2925 88.2122 168.9732 41.6914 31.5844 29.9731 24.3077 24.9934 11.9067 64.7644 69.8840 19.8603 22.2334 22.3305 98.1154 5.4048 7.8191 26.7444 6.0043 14.5419 24.8032
temp: 298.150 k
press: 1.00000 atm
elementType: 8 8 8 7 6 6 6 6 6 6 6 6 6 6 6 6 6 6 6 1 1 1 1 1 1 1 1 1 1 1 1 1 1 1 1 1 1 1 1 1
symmnumber: 1
zpe: 881579.3 jmol-1
zpe.correction: 0.335776 hartree
zpe.thermalcorrener: 0.354221 hartree
zpe.thermalcorrenthalpy: 0.355165 hartree
zpe.thermalcorrgfe: 0.285913 hartree
zpe.sumelectzpe: -863.157552 hartree
zpe.sumelectthermal: -863.139107 hartree
zpe.sumelectthermalent: -863.138163 hartree
zpe.sumelectthermalfe: -863.207415 hartree
dipole: -0.9228 -0.9219 -1.2929
dipole: 1.8366
quadrupole: -100.3730 -110.1940 -113.0968
quadrupole: -4.9432 0.1949 5.5398
quadrupole: 7.5149 -2.3061 -5.2089 -4.9432 0.1949 5.5398
hfenergy: -863.4933279 hartree
pointgroup: C01 [X(C15H21N1O3)]
dipole: -0.3918594 0.346347 0.4985911 debye
polarizability: 211.1661451|0.226792|183.3945834|-1.5827523|12.908491|134.0250284 unknown
InChI: InChI=1S/C15H21NO3/c17-15(18)7-10-19-14-6-4-5-13(11-14)12-16-8-2-1-3-9-16/h4-6,11,17H,1-3,7-10,12H2
charge 0 multiplicity 1
40 atoms
O  2.470307 -0.50285 0.508946
O  5.557203 1.904734 -0.09732
O  3.522276 2.271956 -1.152564
N  -2.739055 0.020625 0.201088
C  -2.690095 0.447626 -1.221799
C  -4.002857 0.444155 0.854374
C  -2.814994 1.979338 -1.345852
C  -4.165571 1.976307 0.799411
C  -4.106567 2.482626 -0.660747
C  -2.480604 -1.429183 0.362211
C  -1.031871 -1.822749 0.079852
C  0.016776 -0.932072 0.419166
C  -0.724857 -3.088565 -0.46954
C  1.360662 -1.315562 0.208413
C  0.625862 -3.466145 -0.667787
C  1.673344 -2.587633 -0.332447
C  2.204168 0.839361 1.048309
C  3.568132 1.510185 1.203423
C  4.15706 1.920537 -0.135595
H  -3.515127 -0.039384 -1.807822
H  -1.733537 0.104285 -1.65466
H  -3.983645 0.101369 1.906537
H  -4.892799 -0.033984 0.363604
H  -2.803298 2.262703 -2.415762
H  -1.933613 2.448731 -0.867103
H  -3.348587 2.441263 1.385004
H  -5.12411 2.262114 1.274086
H  -4.158677 3.587485 -0.690792
H  -4.988871 2.10178 -1.216414
H  -3.157275 -2.052028 -0.27793
H  -2.721128 -1.688559 1.413855
H  -0.262736 0.045853 0.823723
H  -1.534468 -3.775431 -0.743538
H  0.862554 -4.447621 -1.093791
H  2.723073 -2.855725 -0.485816
H  1.566056 1.411811 0.346956
H  1.6947 0.757359 2.029178
H  3.458764 2.429187 1.812758
H  4.273011 0.847022 1.730154
H  5.912394 2.20398 -0.978565
