program: Gaussian 09
title: 000154967
version: EM64L-G09RevD.01
frameworkgroup: C1[X(C21H18BrN3O3S)]
method: RPBEPBE
basis: SDD
operation: Freq
keyword: #p
keyword: freq=noraman
keyword: PBEPBE/SDD
title: #p freq=noraman PBEPBE/SDD
converged: YES YES NO NO
title: Mulliken charges:
elementType: Br S O O O N N N C C C C C C C C C C C C C C C C C C C C C H H H H H H H H H H H H H H H H H H
charge: 0.034905 0.973553 -0.313773 -0.544879 -0.533760 -0.485627 -0.010130 -0.471745 0.235661 0.249504 0.242557 0.032940 -0.088669 0.269978 -0.349556 -0.383516 0.176755 0.281095 -0.292175 -0.329911 -0.300929 -0.480762 -0.334340 -0.259206 -0.256147 -0.223670 -0.232937 -0.768526 -0.525543 0.347064 0.269389 0.232394 0.276925 0.272251 0.243755 0.287977 0.239651 0.231573 0.254000 0.236648 0.262105 0.258643 0.297183 0.272923 0.225608 0.230859 0.249902
chargesum: 0.00000
title: Mulliken charges with hydrogens summed into heavy atoms:
elementType: Br S O O O N N N C C C C C C C C C C C C C C C C C C C C C
charge: 0.034905 0.973553 -0.313773 -0.544879 -0.533760 -0.138563 -0.010130 -0.209640 0.235661 0.249504 0.242557 0.032940 -0.088669 0.269978 -0.080167 -0.151122 0.176755 0.281095 -0.015250 -0.329911 -0.028677 -0.237007 -0.046363 -0.019555 -0.024574 0.030330 0.003711 0.060223 0.180827
polarizability: 6.29040564e+02 7.55274235e+01 4.14442521e+02 -2.63873015e+01 -1.97230331e+01 1.85387364e+02
1716.lowfreq: -2.1443 -0.0010 0.0004 0.0008 3.0673 4.1852 14.2767 18.9916 20.4082
frequency: 14.1846 18.9652 20.3988 27.1282 39.9316 48.1270 73.7888 85.2809 100.5671 105.9811 113.0718 118.0027 133.8559 137.5727 150.2726 163.2479 184.3737 197.1666 217.5859 236.3619 247.7626 250.7072 274.6152 277.4356 291.2491 314.1486 317.1519 329.9161 366.4535 384.9323 397.8836 411.5757 416.0971 451.8461 456.1798 467.6606 497.1107 521.5870 529.8627 535.8308 541.3759 560.9098 579.4978 595.9208 608.1204 624.0727 645.1009 653.4822 673.4943 713.3877 719.7070 742.6897 753.9561 769.8261 775.5158 798.1228 807.7341 814.9420 824.1077 839.6156 852.4081 856.0832 875.8034 879.8242 887.9900 906.8714 920.3151 934.3871 944.9011 961.2148 967.2076 977.6369 997.6996 1000.5355 1003.7394 1021.1582 1065.1269 1078.5775 1113.9231 1117.0457 1123.4998 1152.2269 1161.6882 1169.3145 1182.9368 1184.3766 1196.4999 1225.1948 1248.6132 1261.9893 1278.6462 1285.1435 1297.1546 1312.1739 1333.8556 1360.3357 1380.6444 1396.6525 1408.9085 1416.7821 1418.5800 1425.3781 1433.4103 1446.3152 1451.3506 1466.0896 1467.0070 1472.7743 1479.6382 1513.0652 1516.5832 1542.6552 1550.9465 1574.2969 1600.4061 1606.0581 1625.0245 2968.7757 3028.9295 3060.6275 3127.2270 3132.2625 3141.4696 3141.7737 3147.4922 3158.4570 3165.9373 3167.6976 3174.2677 3178.5056 3180.0478 3183.5465 3187.6848 3333.8119 3480.7265
redmass: 6.3243 8.7868 6.0965 6.8298 4.4273 5.8513 5.4374 5.0883 5.3744 3.9857 9.7668 7.0221 5.5775 4.8868 4.4825 1.1468 2.9374 4.9154 1.6524 4.1654 4.1973 5.0597 6.0033 3.1952 6.3547 5.8675 6.4029 5.9379 7.4167 3.7505 5.2948 5.8325 4.5444 3.2087 4.7848 6.2915 3.7041 6.3835 4.6470 7.6749 5.1582 4.1090 3.2843 2.2671 6.4987 4.5291 2.4422 5.8521 5.4910 5.7762 3.5521 3.8497 3.5266 1.5610 1.7763 4.1356 9.0805 1.4161 3.4510 1.6672 4.4094 1.4322 2.6364 2.8378 2.1758 1.3960 4.5852 6.3632 1.3431 1.3477 1.3583 1.3327 1.3318 2.4610 3.6654 2.1424 2.1291 5.3742 2.2610 1.2620 2.1036 1.3926 1.2456 1.8340 1.2015 1.2522 1.4039 1.9148 2.5686 1.9628 1.1508 2.7753 3.7967 2.1303 2.3725 2.3803 3.1845 3.8508 1.0631 1.1085 2.4925 4.8890 1.4183 2.7117 3.2868 1.0966 1.6646 2.2637 1.4116 3.8021 7.0671 7.5987 5.8270 3.9562 6.3038 5.8904 6.4296 1.0325 1.0238 1.1045 1.0861 1.1000 1.0910 1.0896 1.0869 1.0952 1.0897 1.0917 1.0994 1.1071 1.0983 1.1079 1.0967 1.0753 1.0743
irintensity: 3.5238 0.3643 1.3972 0.1779 4.6266 0.2259 0.3642 4.2732 50.1844 19.5505 3.3070 21.5971 0.5479 6.7071 14.3464 4.2707 2.0647 5.1184 8.6796 4.8876 2.2693 2.1845 5.3665 8.9665 0.7819 2.8353 15.9943 6.8693 32.8176 1.6615 71.1575 8.1626 1.4562 12.2547 6.7155 0.9798 1.7562 6.5942 21.2166 36.0625 10.9754 6.6559 10.6331 150.8360 14.4375 18.9419 30.8489 20.2240 59.4980 4.3686 8.7800 50.6625 34.7576 68.6855 22.4787 4.8335 115.5450 18.7258 14.5722 50.7595 0.9338 90.2249 4.4856 1.2535 14.0308 3.1551 4.1380 12.2637 158.2005 1.3894 1.1302 0.7081 0.2980 7.7488 78.9217 8.8803 3.6943 50.0326 33.4906 0.3407 59.8784 1.0833 2.0133 43.4471 12.3837 31.8024 4.8791 30.7274 9.7586 0.1861 21.7106 50.9502 46.5284 50.1882 44.9916 91.5377 60.0482 103.5848 4.0301 23.5544 35.9560 258.3906 2.9796 17.8585 6.0526 26.4594 100.5744 53.1412 90.3830 490.3781 52.2523 50.7480 15.3834 25.6690 117.1939 270.5796 18.0870 60.0051 1.3199 33.8551 0.5723 15.8742 6.4765 13.6281 3.5926 21.1354 10.6705 1.3240 29.1875 0.3390 9.5842 1.6378 1.0043 11.4340 74.1916
temp: 298.150 k
press: 1.00000 atm
elementType: 35 16 8 8 8 7 7 7 6 6 6 6 6 6 6 6 6 6 6 6 6 6 6 6 6 6 6 6 6 1 1 1 1 1 1 1 1 1 1 1 1 1 1 1 1 1 1
symmnumber: 1
zpe: 904707.9 jmol-1
zpe.correction: 0.344585 hartree
zpe.thermalcorrener: 0.372165 hartree
zpe.thermalcorrenthalpy: 0.373109 hartree
zpe.thermalcorrgfe: 0.282812 hartree
zpe.sumelectzpe: -1610.262067 hartree
zpe.sumelectthermal: -1610.234487 hartree
zpe.sumelectthermalent: -1610.233543 hartree
zpe.sumelectthermalfe: -1610.323840 hartree
dipole: -0.5836 8.0078 6.1848
dipole: 10.1350
quadrupole: -223.1151 -165.2008 -187.6104
quadrupole: -22.8565 -35.6381 -7.6049
quadrupole: -31.1397 26.7746 4.3650 -22.8565 -35.6381 -7.6049
hfenergy: -1610.6066519 hartree
pointgroup: C01 [X(C21H18Br1N3O3S1)]
dipole: -0.1890023 1.627337 -3.6353104 debye
polarizability: 629.5144513|-83.9186103|377.2776294|-30.7465797|-75.7675456|222.0783689 unknown
InChI: InChI=1S/C21H18BrN3O3S/c1-28-19-12-13(25-29(2,26)27)10-11-18(19)24-20-14-6-3-4-9-17(14)23-21-15(20)7-5-8-16(21)22/h3-12,24-25H,1-2H3
charge 0 multiplicity 1
47 atoms
Br -5.129445 -2.870403 2.121718
S  5.774701 -1.628738 0.863955
O  1.557162 1.507592 -2.594986
O  7.391103 -1.511263 1.033342
O  4.855196 -2.424827 1.945524
N  -0.342799 0.710578 -0.977734
N  -4.137759 -0.240056 0.798841
N  5.022463 0.319225 0.796752
C  -1.569027 0.371536 -0.35556
C  -1.850727 -0.953876 0.111777
C  -2.583157 1.379569 -0.271771
C  -3.16275 -1.189044 0.724848
C  -3.872629 1.005269 0.294348
C  0.964223 0.545846 -0.502009
C  -0.942219 -2.054838 -0.053148
C  -2.385013 2.740096 -0.695066
C  2.021898 0.979801 -1.374426
C  3.701023 0.390388 0.314004
C  1.310136 0.053589 0.785194
C  -3.426038 -2.518499 1.236976
C  -4.921287 1.987713 0.354936
C  3.365406 0.874937 -0.993535
C  2.652131 -0.019268 1.189547
C  -1.263556 -3.318238 0.430545
C  -3.421888 3.667706 -0.615499
C  -2.508361 -3.553159 1.10362
C  -4.706376 3.285659 -0.098254
C  5.431375 -2.482801 -0.841302
C  2.548764 2.025226 -3.540939
H  -0.397005 1.282119 -1.8276
H  0.006349 -1.89664 -0.571729
H  -1.401375 3.061355 -1.055188
H  0.519727 -0.247691 1.477342
H  -5.878667 1.666826 0.776164
H  4.166323 1.18922 -1.672224
H  2.919879 -0.378111 2.186841
H  -0.56686 -4.152568 0.301057
H  -3.255352 4.702287 -0.934542
H  -2.738407 -4.547817 1.495893
H  -5.510041 4.027979 -0.046673
H  5.720335 0.760271 0.162219
H  6.077015 -1.986288 -1.578485
H  5.70545 -3.535968 -0.688129
H  4.359709 -2.357761 -1.048226
H  3.228176 1.220235 -3.88005
H  3.135296 2.848001 -3.089592
H  1.967999 2.403731 -4.394278
