program: Gaussian 09
title: 000154965
version: EM64L-G09RevD.01
frameworkgroup: C1[X(C21H18ClN3O3S)]
method: RPBEPBE
basis: SDD
operation: Freq
keyword: #p
keyword: freq=noraman
keyword: PBEPBE/SDD
title: #p freq=noraman PBEPBE/SDD
converged: YES YES NO NO
title: Mulliken charges:
elementType: Cl S O O O N N N C C C C C C C C C C C C C C C C C C C C C H H H H H H H H H H H H H H H H H H
charge: -0.013198 0.973083 -0.313672 -0.544994 -0.534166 -0.485923 0.005993 -0.470062 0.237018 0.252955 0.242147 -0.010513 -0.080216 0.270840 -0.355689 -0.383346 0.177123 0.278920 -0.292908 -0.231970 -0.305425 -0.480343 -0.333394 -0.252989 -0.256166 -0.260442 -0.231901 -0.768937 -0.525618 0.346981 0.269397 0.232425 0.276885 0.273218 0.243723 0.287869 0.238265 0.231502 0.260422 0.236698 0.261564 0.258571 0.297127 0.272790 0.225615 0.230856 0.249881
chargesum: 0.00000
title: Mulliken charges with hydrogens summed into heavy atoms:
elementType: Cl S O O O N N N C C C C C C C C C C C C C C C C C C C C C
charge: -0.013198 0.973083 -0.313672 -0.544994 -0.534166 -0.138941 0.005993 -0.208498 0.237018 0.252955 0.242147 -0.010513 -0.080216 0.270840 -0.086291 -0.150921 0.177123 0.278920 -0.016023 -0.231970 -0.032206 -0.236620 -0.045526 -0.014724 -0.024664 -0.000020 0.004797 0.059552 0.180735
polarizability: 6.28115935e+02 5.95733434e+01 3.89787911e+02 -2.67900432e+01 -1.66847099e+01 1.83934671e+02
1716.lowfreq: -11.9191 -6.0424 -1.3268 -0.0013 0.0004 0.0015 3.4952 17.8793 19.5940
frequency: -11.2662 17.8431 19.5011 29.9957 39.5925 48.5869 79.1280 84.6129 101.7332 105.3191 117.7000 132.8645 136.7141 149.3212 157.3142 163.1323 185.3651 202.6566 218.6015 239.8881 249.7431 253.1959 277.7481 278.6492 311.1875 316.4567 329.7214 360.3642 368.8291 384.2806 400.9408 415.5376 423.0663 451.0493 459.9389 472.0392 497.0668 521.5975 530.6438 535.7137 541.4717 562.0330 579.4147 596.7331 611.0894 624.2904 646.3984 654.6803 678.9006 713.2254 719.9463 746.3856 761.1987 769.9379 774.6258 798.7370 807.4270 814.1904 822.3072 838.8796 853.8970 857.8166 877.2905 881.9693 887.7503 901.6228 920.4347 938.5065 945.1047 959.8006 966.9023 974.3070 997.5637 999.8024 1003.5272 1021.4047 1065.4109 1082.5647 1116.8291 1118.0043 1124.9087 1152.4230 1161.4315 1169.7242 1182.4312 1184.1154 1196.3023 1225.5736 1248.5839 1261.9783 1278.1013 1285.3151 1296.5915 1313.0562 1335.2643 1362.2000 1381.7182 1397.2724 1408.8670 1417.2208 1421.5066 1425.8247 1433.2992 1446.3350 1452.7635 1465.5666 1468.7732 1472.7251 1479.7670 1513.4876 1520.3241 1544.3879 1550.9326 1574.1177 1602.4436 1607.1000 1626.3385 2968.7566 3028.7809 3060.4840 3128.2887 3132.2868 3141.5260 3142.2969 3147.6638 3158.4073 3166.5788 3169.0792 3174.2936 3178.6906 3180.3920 3183.1100 3187.2671 3332.1625 3480.9892
redmass: 6.2142 6.1795 7.1905 6.9191 4.5343 5.8382 5.4835 5.0145 5.1295 4.5883 6.1805 5.2239 4.9755 5.1571 3.6552 1.3027 3.3006 4.8658 1.7425 3.5248 4.8851 4.4384 3.6480 4.4021 5.7779 7.0821 6.0299 7.1354 8.1695 3.6487 5.3208 4.3503 6.6926 3.2032 4.6783 7.1290 3.6889 6.5492 4.8050 7.2675 5.1730 4.2310 3.3740 2.2909 6.3146 4.5337 2.3770 5.4936 5.3896 5.7635 3.5634 2.7559 4.9306 1.5499 1.9111 4.0276 8.6774 1.4204 3.5102 1.6652 3.8914 1.5027 1.8471 5.4185 2.1555 1.3909 4.5763 6.3663 1.3454 1.3503 1.3591 1.3305 1.3324 2.4070 3.7647 2.1246 2.0722 4.9674 1.2587 2.1069 2.3347 1.3975 1.2409 1.8147 1.1893 1.2567 1.4330 1.9174 2.5240 1.9857 1.1435 2.9245 3.7314 2.1078 2.3839 2.4545 3.1444 3.6659 1.0623 1.0653 2.9741 4.8244 1.4054 2.7821 3.1969 1.2170 1.4585 2.0867 1.4978 3.7694 7.2369 7.5974 5.8748 3.8482 6.4366 5.7810 6.5108 1.0325 1.0239 1.1045 1.0855 1.0999 1.0910 1.0896 1.0870 1.0953 1.0893 1.0920 1.0995 1.1071 1.0984 1.1079 1.0969 1.0753 1.0743
irintensity: 3.4951 1.5939 0.2509 0.2105 4.7980 0.2442 0.4186 4.6098 36.9435 43.4538 14.1969 1.5315 4.8022 9.9723 3.5845 3.5245 4.1765 4.2736 9.4592 3.8317 3.4166 1.6926 3.5990 9.7916 0.9786 18.9695 5.1358 12.8332 18.4283 2.4118 78.3105 1.4786 0.9829 11.5936 6.4622 0.5754 1.4619 6.8162 24.1377 33.4495 10.0912 5.6843 8.1721 150.0677 7.4578 17.0962 33.8356 15.9614 60.2314 4.6256 7.9287 53.9415 36.9372 67.8281 20.9630 6.3351 118.0817 16.4302 16.9640 49.6755 2.8777 90.0611 3.4546 5.4483 12.6796 3.2199 3.9030 15.1955 156.5549 1.2799 1.1608 0.7902 0.2856 10.0022 75.8948 9.0521 5.4601 44.0521 0.0604 65.3567 29.9399 1.0668 1.4382 41.6954 11.0636 33.6760 5.2125 30.4802 10.7530 0.2959 18.7851 50.5068 53.9862 49.1628 43.7902 82.0566 60.2020 116.2077 4.3575 16.7236 59.5132 224.4575 3.0601 15.6752 6.7211 47.8825 60.4106 55.2395 91.8191 486.8621 43.5512 49.8519 14.4612 26.9420 206.1940 178.7686 17.4850 59.0509 1.2844 33.8868 0.2422 15.9008 6.1815 13.7867 3.6034 20.7079 9.3599 1.4717 29.4414 0.3528 8.9767 1.5918 1.1232 11.4632 73.5250
temp: 298.150 k
press: 1.00000 atm
elementType: 17 16 8 8 8 7 7 7 6 6 6 6 6 6 6 6 6 6 6 6 6 6 6 6 6 6 6 6 6 1 1 1 1 1 1 1 1 1 1 1 1 1 1 1 1 1 1
symmnumber: 1
zpe: 905871.3 jmol-1
zpe.correction: 0.345028 hartree
zpe.thermalcorrener: 0.371472 hartree
zpe.thermalcorrenthalpy: 0.372417 hartree
zpe.thermalcorrgfe: 0.286583 hartree
zpe.sumelectzpe: -2056.862353 hartree
zpe.sumelectthermal: -2056.835909 hartree
zpe.sumelectthermalent: -2056.834964 hartree
zpe.sumelectthermalfe: -2056.920798 hartree
dipole: 0.4195 7.9472 6.2635
dipole: 10.1275
quadrupole: -226.3417 -162.2351 -184.7302
quadrupole: -11.4672 -33.4446 -4.7812
quadrupole: -35.2394 28.8672 6.3722 -11.4672 -33.4446 -4.7812
hfenergy: -2057.207381 hartree
pointgroup: C01 [X(C21H18Cl1N3O3S1)]
dipole: -0.1955482 1.5983035 -3.6445979 debye
polarizability: 613.0773845|-91.9526184|371.5707576|-21.3680166|-72.3264362|217.1903751 unknown
InChI: InChI=1S/C20H15ClN3O.CH3O2S/c1-25-18-11-12(22)9-10-17(18)24-19-13-5-2-3-8-16(13)23-20-14(19)6-4-7-15(20)21;1-4(2)3/h2-11,22,24H,1H3;1H3
charge 0 multiplicity 1
47 atoms
Cl -5.002406 -2.847294 2.063108
S  5.771933 -1.616963 0.866348
O  1.547433 1.499696 -2.601097
O  7.388531 -1.50136 1.036479
O  4.851191 -2.409644 1.949646
N  -0.349199 0.708312 -0.976839
N  -4.142621 -0.250412 0.805896
N  5.018558 0.334098 0.792916
C  -1.573688 0.366513 -0.352528
C  -1.849681 -0.957858 0.120599
C  -2.592586 1.370307 -0.272086
C  -3.161052 -1.193588 0.733011
C  -3.880696 0.993911 0.296767
C  0.958581 0.548817 -0.501995
C  -0.937897 -2.057701 -0.03684
C  -2.400021 2.729831 -0.701338
C  2.014579 0.979533 -1.378224
C  3.696843 0.401631 0.311261
C  1.306907 0.064416 0.787611
C  -3.418772 -2.52135 1.246887
C  -4.932601 1.973186 0.354333
C  3.35867 0.878633 -0.998549
C  2.649454 -0.004449 1.190502
C  -1.256721 -3.320082 0.452416
C  -3.440046 3.654146 -0.624714
C  -2.50243 -3.556275 1.122504
C  -4.72271 3.269957 -0.104516
C  5.429245 -2.47636 -0.836376
C  2.537082 2.012084 -3.551897
H  -0.406066 1.274926 -1.829813
H  0.011613 -1.899986 -0.553723
H  -1.41791 3.053093 -1.063813
H  0.517779 -0.234184 1.482354
H  -5.888447 1.650747 0.777678
H  4.158275 1.190239 -1.680023
H  2.919164 -0.357628 2.189285
H  -0.556301 -4.152077 0.328382
H  -3.277345 4.687895 -0.948423
H  -2.736784 -4.548025 1.519539
H  -5.528836 4.009785 -0.055334
H  5.715254 0.771331 0.154297
H  6.075365 -1.982431 -1.574878
H  5.702917 -3.529143 -0.679823
H  4.357728 -2.351684 -1.044281
H  3.216687 1.20552 -3.886887
H  3.123636 2.838236 -3.106784
H  1.95469 2.384652 -4.406741
