program: Gaussian 09
title: 000158096
version: EM64L-G09RevD.01
frameworkgroup: C1[X(C21H22O10)]
method: RPBEPBE
basis: SDD
operation: Freq
keyword: #p
keyword: freq=noraman
keyword: PBEPBE/SDD
title: #p freq=noraman PBEPBE/SDD
converged: YES YES NO NO
title: Mulliken charges:
elementType: O O O O O O O O O O C C C C C C C C C C C C C C C C C C C C C H H H H H H H H H H H H H H H H H H H H H H
charge: -0.320293 -0.459557 -0.465600 -0.463524 -0.437292 -0.302770 -0.374809 -0.446907 -0.426194 -0.473912 -0.047543 -0.548600 -0.159325 -0.181310 -0.082613 -0.033065 0.462192 0.539279 0.020680 -0.384867 -0.138621 0.052874 -0.582716 -0.454838 0.175234 -0.019755 0.442802 -0.617390 -0.350221 0.137479 -0.437794 0.250083 0.269105 0.247990 0.233378 0.222435 0.235636 0.200896 0.251462 0.333513 0.377264 0.254282 0.370426 0.366357 0.224569 0.256041 0.344999 0.212358 0.216042 0.359552 0.398060 0.391716 0.362809
chargesum: 0.00000
title: Mulliken charges with hydrogens summed into heavy atoms:
elementType: O O O O O O O O O O C C C C C C C C C C C C C C C C C C C C C
charge: -0.320293 -0.082293 -0.095174 -0.097167 -0.092294 -0.302770 -0.015256 -0.048846 -0.034477 -0.111103 0.202540 -0.279494 0.088666 0.052068 0.139822 0.202570 0.462192 0.539279 0.020680 0.067490 -0.138621 0.052874 -0.249203 -0.200556 0.175234 -0.019755 0.442802 -0.392820 -0.094179 0.137479 -0.009394
polarizability: 3.49413408e+02 -4.10452903e+01 2.81979763e+02 2.31207133e+01 3.90341221e+01 1.97830273e+02
1716.lowfreq: -9.5849 -6.5769 -0.0011 -0.0009 -0.0007 1.8605 10.0725 15.6441 28.8846
frequency: 8.1836 14.8778 28.8293 36.4452 45.2731 52.4816 63.0888 85.5788 100.8583 123.3396 124.3557 138.8624 141.7172 156.7257 176.7128 183.6832 208.6331 220.2487 224.6648 236.5724 249.7403 255.9739 275.3799 276.8499 304.2795 311.1078 313.9966 321.3109 335.0167 344.1834 365.2421 377.5917 402.7578 417.9560 426.8107 430.2680 439.6327 445.5788 456.4454 458.5635 462.4014 478.3168 492.7100 494.5536 515.6110 532.2525 537.4106 561.6713 573.1565 577.1396 577.9576 592.0901 597.8561 629.2009 644.0024 664.8051 689.3357 724.8653 739.6422 775.9171 798.3745 799.8949 826.2094 832.6207 848.2505 904.2500 911.2777 938.6012 949.8157 956.5081 960.5176 977.1562 986.9630 990.9735 994.1391 1008.1352 1013.4920 1021.8505 1029.6570 1035.3452 1046.0825 1049.5903 1058.4779 1070.0505 1087.5051 1109.9808 1122.8366 1155.5909 1162.2752 1171.9911 1176.7062 1189.4641 1197.3214 1201.7031 1205.7222 1208.2281 1213.2622 1214.0617 1226.1247 1247.6831 1259.9054 1269.0328 1277.2361 1280.5727 1296.2912 1305.8034 1311.5971 1318.7119 1320.7464 1328.5299 1340.0460 1344.0261 1355.1052 1369.7112 1381.0499 1384.9432 1392.7030 1398.9051 1405.6087 1419.7933 1432.0480 1441.7208 1462.0476 1464.6957 1465.5340 1485.9335 1549.6181 1586.2798 1606.5657 1618.2149 1628.6349 2576.6347 2925.1026 2954.5685 2958.4544 2961.6880 2967.0765 2970.2095 2984.3374 2991.2903 3000.8155 3096.8859 3109.8348 3134.1084 3173.6965 3212.2011 3486.1332 3534.0925 3540.7228 3543.5529 3548.2898 3556.5894 3590.9343
redmass: 6.6551 5.6489 6.8845 4.6147 5.1555 7.0068 5.9808 5.2419 7.0960 5.7990 6.0789 7.2057 4.2252 4.9279 3.9370 3.9724 5.1030 4.8030 4.5094 4.9133 3.8319 1.3177 6.3544 4.0459 5.1545 5.8699 4.6073 5.5107 1.2656 4.2214 5.7718 4.3742 3.2106 3.1366 1.6630 2.0388 1.1432 1.3699 7.1000 2.5833 2.6291 3.8897 5.1607 5.0819 4.9776 1.2668 3.2280 4.2251 5.5770 4.5292 3.7012 5.1706 4.5919 5.8352 4.9072 4.3831 4.9246 5.5594 5.0416 5.3742 7.0077 3.7356 1.4525 1.8235 2.9108 3.6867 1.4674 1.3704 5.5557 6.2319 5.7131 4.4383 1.0737 3.7597 5.1380 2.2677 3.2755 3.6979 4.1411 3.5844 3.3190 2.7955 2.5168 2.7239 3.2252 2.0533 2.1294 1.6116 1.3172 1.3960 1.4838 1.2520 1.2516 1.3793 1.5467 1.2469 1.2866 1.2266 1.1669 1.7613 1.2195 1.4594 2.0030 1.3078 1.3248 1.2538 2.0080 3.3421 1.4506 1.9546 3.0217 1.2599 1.5993 1.6613 1.3070 2.4999 1.4157 1.8957 3.0146 2.4830 3.3925 5.0633 1.0928 2.1271 1.4871 3.4338 4.0672 6.2451 5.3844 6.1943 5.7880 1.0712 1.0557 1.0823 1.0814 1.0760 1.0791 1.1039 1.0827 1.0826 1.0855 1.0913 1.0945 1.0898 1.0948 1.0914 1.0645 1.0657 1.0656 1.0665 1.0653 1.0654 1.0667
irintensity: 2.2878 4.5457 0.0290 8.6530 1.1093 0.0850 1.5396 3.5020 1.1947 1.7345 1.3309 0.7655 1.3225 5.2016 18.3056 4.9831 1.4452 12.9814 0.4132 0.8705 1.8013 124.9731 9.8457 8.3265 8.0322 9.4397 8.3273 6.5351 79.8786 17.9252 3.6863 21.9140 4.7605 2.0975 81.9446 82.4157 157.0329 147.4996 11.8985 18.0860 65.9195 26.1833 9.8206 5.5688 16.6883 113.9124 24.8566 21.5629 1.8583 45.0725 13.0832 3.2598 9.2786 24.5320 10.6819 4.9727 14.7941 3.7028 13.7574 7.7073 54.6978 9.9700 9.7204 37.9487 40.4687 24.6219 16.0130 0.7788 40.7167 68.5834 21.0924 172.4540 108.2653 49.6316 27.9042 13.7015 48.8884 112.5112 28.6735 38.0767 16.3529 49.8017 147.2470 42.0129 41.5628 17.2012 9.7935 44.0458 46.8371 64.8384 209.7295 20.6565 18.9463 33.1204 50.2077 40.7021 0.5083 13.8478 19.4358 8.3415 5.9373 14.2366 133.0009 84.0992 49.9890 66.1783 143.0923 120.4258 7.1106 168.1452 103.5598 20.7261 62.1871 4.1726 29.3112 0.9141 5.7135 36.6189 64.3997 189.4969 119.3955 266.8826 9.6270 1.3426 10.1973 15.9301 40.1179 69.8168 6.5165 175.2690 83.0555 407.5171 55.8566 5.2067 18.8635 11.6911 3.8173 37.0640 69.7157 4.4631 73.3257 19.7634 11.0231 8.7562 5.8885 4.2207 84.8229 32.1265 21.9035 57.6997 3.8842 18.9545 10.2726
temp: 298.150 k
press: 1.00000 atm
elementType: 8 8 8 8 8 8 8 8 8 8 6 6 6 6 6 6 6 6 6 6 6 6 6 6 6 6 6 6 6 6 6 1 1 1 1 1 1 1 1 1 1 1 1 1 1 1 1 1 1 1 1 1 1
symmnumber: 1
zpe: 1056650.9 jmol-1
zpe.correction: 0.402457 hartree
zpe.thermalcorrener: 0.431633 hartree
zpe.thermalcorrenthalpy: 0.432577 hartree
zpe.thermalcorrgfe: 0.341069 hartree
zpe.sumelectzpe: -1563.356087 hartree
zpe.sumelectthermal: -1563.326911 hartree
zpe.sumelectthermalent: -1563.325967 hartree
zpe.sumelectthermalfe: -1563.417475 hartree
dipole: -2.0453 6.4137 0.0815
dipole: 6.7325
quadrupole: -205.7932 -152.7880 -182.8930
quadrupole: -24.2791 -4.5659 -0.6748
quadrupole: -25.3018 27.7034 -2.4016 -24.2791 -4.5659 -0.6748
hfenergy: -1563.7585439 hartree
pointgroup: C01 [X(C21H22O10)]
dipole: -1.1381569 -2.3900863 -0.0893453 debye
polarizability: 358.729646|31.5798799|269.7235208|-18.5904106|43.5476755|200.7702775 unknown
InChI: InChI=1S/C21H22O10/c22-5-7-3-9-13(21-20(30)19(29)17(27)12(6-23)31-21)8-1-2-10(24)16(26)15(8)18(28)14(9)11(25)4-7/h1-4,12-13,17,19-27,29-30H,5-6H2
charge 0 multiplicity 1
53 atoms
O  -1.965793 1.231854 0.942162
O  0.744757 1.793061 -1.643902
O  -1.629425 2.380406 -3.092626
O  -3.831035 3.310477 -1.534458
O  -4.15998 2.021324 2.564242
O  2.916969 -2.090662 -1.291574
O  1.049674 -3.941691 -1.630123
O  4.842855 -0.638517 -0.659402
O  5.84168 1.416383 0.80591
O  -4.10441 -2.289336 1.239806
C  -0.578857 1.366062 0.456343
C  0.218886 0.184432 1.129496
C  -0.55631 1.377134 -1.095081
C  -1.528644 2.437759 -1.630593
C  -2.945341 2.234863 -1.08739
C  -2.905718 2.273587 0.449645
C  -0.181964 -1.174498 0.55425
C  1.710661 0.4760 1.089411
C  0.703332 -1.940228 -0.277756
C  -4.247273 1.938376 1.103845
C  2.562644 -0.290656 0.235103
C  2.086171 -1.476775 -0.503708
C  -1.480132 -1.647811 0.838006
C  2.264577 1.52729 1.844816
C  0.212229 -3.176835 -0.81982
C  3.950374 0.044427 0.143892
C  -1.948758 -2.862431 0.295323
C  -1.098854 -3.620101 -0.537753
C  3.643791 1.847713 1.763406
C  4.485312 1.11745 0.90879
C  -3.346718 -3.369065 0.604999
H  -0.148218 2.325623 0.817931
H  -0.120122 0.217624 2.184115
H  -0.849436 0.379547 -1.481541
H  -1.154988 3.437779 -1.317089
H  -3.323029 1.248018 -1.433542
H  -2.556984 3.272734 0.788109
H  -4.56679 0.92487 0.779621
H  -5.000257 2.679411 0.796327
H  -2.15394 -1.055814 1.456139
H  1.451544 1.142554 -1.3994
H  1.623567 2.111468 2.514387
H  -0.708755 2.447892 -3.45546
H  -3.687998 3.413892 -2.511551
H  -1.452505 -4.564377 -0.976132
H  4.072475 2.661619 2.355175
H  -3.41303 1.430583 2.84206
H  -3.835539 -3.700586 -0.336762
H  -3.273759 -4.25189 1.278909
H  0.586295 -4.772222 -1.913066
H  4.273694 -1.388386 -1.127728
H  6.25277 0.777112 0.161857
H  -4.981897 -2.626543 1.54608
